======================================================================
FAIL: test_geturl (test.test_urllibnet.urlopenNetworkTests)
----------------------------------------------------------------------
Traceback (most recent call last):
File "/Users/veerkat/Applications/stackless/Lib/test/
test_urllibnet.py", line 86, in test_geturl
self.assertEqual(gotten_url, URL)
AssertionError: '
https://www.python.org/' != '
http://www.python.org/'-
https://www.python.org/? -
+
http://www.python.org/----------------------------------------------------------------------
Ran 13 tests in 229.079s
FAILED (failures=1)
test test_urllibnet failed
make: *** [test] Error 1
这是什么问题
这是一个专为移动设备优化的页面(即为了让你能够在 Google 搜索结果里秒开这个页面),如果你希望参与 V2EX 社区的讨论,你可以继续到 V2EX 上打开本讨论主题的完整版本。
https://www.v2ex.com/t/153784
V2EX 是创意工作者们的社区,是一个分享自己正在做的有趣事物、交流想法,可以遇见新朋友甚至新机会的地方。
V2EX is a community of developers, designers and creative people.