首页   注册   登录
V2EX = way to explore
V2EX 是一个关于分享和探索的地方
现在注册
已注册用户请  登录
V2EX 提问指南
Coding
V2EX  ›  问与答

阿里云 mysql 编译出错

  •  
  •   hcw1588 · 2014-02-15 23:02:04 +08:00 · 6133 次点击
    这是一个创建于 2128 天前的主题,其中的信息可能已经有所发展或是发生改变。
    Determining if the function floor exists failed with the following output:
    Change Dir: /root/lnmp/src/mysql-5.6.16/CMakeFiles/CMakeTmp

    Run Build Command:/usr/bin/gmake "cmTryCompileExec2692364841/fast"
    /usr/bin/gmake -f CMakeFiles/cmTryCompileExec2692364841.dir/build.make CMakeFiles/cmTryCompileExec2692364841.dir/build
    gmake[1]: Entering directory `/root/lnmp/src/mysql-5.6.16/CMakeFiles/CMakeTmp'
    /usr/local/bin/cmake -E cmake_progress_report /root/lnmp/src/mysql-5.6.16/CMakeFiles/CMakeTmp/CMakeFiles 1
    Building C object CMakeFiles/cmTryCompileExec2692364841.dir/CheckFunctionExists.c.o
    /usr/bin/cc -Wall -DCHECK_FUNCTION_EXISTS=floor -o CMakeFiles/cmTryCompileExec2692364841.dir/CheckFunctionExists.c.o -c /usr/local/share/cmake-2.8/Modules/CheckFunctionExists.c
    /usr/local/share/cmake-2.8/Modules/CheckFunctionExists.c:3: 警告:与内建函数‘floor’类型冲突
    Linking C executable cmTryCompileExec2692364841
    /usr/local/bin/cmake -E cmake_link_script CMakeFiles/cmTryCompileExec2692364841.dir/link.txt --verbose=1
    /usr/bin/cc -Wall -DCHECK_FUNCTION_EXISTS=floor CMakeFiles/cmTryCompileExec2692364841.dir/CheckFunctionExists.c.o -o cmTryCompileExec2692364841 -rdynamic
    CMakeFiles/cmTryCompileExec2692364841.dir/CheckFunctionExists.c.o: In function `main':
    CheckFunctionExists.c:(.text+0x15): undefined reference to `floor'
    collect2: ld 返回 1
    gmake[1]: *** [cmTryCompileExec2692364841] 错误 1
    gmake[1]: Leaving directory `/root/lnmp/src/mysql-5.6.16/CMakeFiles/CMakeTmp'
    gmake: *** [cmTryCompileExec2692364841/fast] 错误 2


    Determining if the function crypt exists failed with the following output:
    Change Dir: /root/lnmp/src/mysql-5.6.16/CMakeFiles/CMakeTmp

    Run Build Command:/usr/bin/gmake "cmTryCompileExec1587011097/fast"
    /usr/bin/gmake -f CMakeFiles/cmTryCompileExec1587011097.dir/build.make CMakeFiles/cmTryCompileExec1587011097.dir/build
    gmake[1]: Entering directory `/root/lnmp/src/mysql-5.6.16/CMakeFiles/CMakeTmp'
    /usr/local/bin/cmake -E cmake_progress_report /root/lnmp/src/mysql-5.6.16/CMakeFiles/CMakeTmp/CMakeFiles 1
    Building C object CMakeFiles/cmTryCompileExec1587011097.dir/CheckFunctionExists.c.o
    /usr/bin/cc -Wall -DCHECK_FUNCTION_EXISTS=crypt -o CMakeFiles/cmTryCompileExec1587011097.dir/CheckFunctionExists.c.o -c /usr/local/share/cmake-2.8/Modules/CheckFunctionExists.c
    Linking C executable cmTryCompileExec1587011097
    /usr/local/bin/cmake -E cmake_link_script CMakeFiles/cmTryCompileExec1587011097.dir/link.txt --verbose=1
    /usr/bin/cc -Wall -DCHECK_FUNCTION_EXISTS=crypt CMakeFiles/cmTryCompileExec1587011097.dir/CheckFunctionExists.c.o -o cmTryCompileExec1587011097 -rdynamic
    CMakeFiles/cmTryCompileExec1587011097.dir/CheckFunctionExists.c.o: In function `main':
    CheckFunctionExists.c:(.text+0x15): undefined reference to `crypt'
    collect2: ld 返回 1
    gmake[1]: *** [cmTryCompileExec1587011097] 错误 1
    gmake[1]: Leaving directory `/root/lnmp/src/mysql-5.6.16/CMakeFiles/CMakeTmp'
    gmake: *** [cmTryCompileExec1587011097/fast] 错误 2


    Determining if the function dlopen exists failed with the following output:
    Change Dir: /root/lnmp/src/mysql-5.6.16/CMakeFiles/CMakeTmp

    Run Build Command:/usr/bin/gmake "cmTryCompileExec2473426599/fast"
    /usr/bin/gmake -f CMakeFiles/cmTryCompileExec2473426599.dir/build.make CMakeFiles/cmTryCompileExec2473426599.dir/build
    gmake[1]: Entering directory `/root/lnmp/src/mysql-5.6.16/CMakeFiles/CMakeTmp'
    /usr/local/bin/cmake -E cmake_progress_report /root/lnmp/src/mysql-5.6.16/CMakeFiles/CMakeTmp/CMakeFiles 1
    Building C object CMakeFiles/cmTryCompileExec2473426599.dir/CheckFunctionExists.c.o
    /usr/bin/cc -Wall -DCHECK_FUNCTION_EXISTS=dlopen -o CMakeFiles/cmTryCompileExec2473426599.dir/CheckFunctionExists.c.o -c /usr/local/share/cmake-2.8/Modules/CheckFunctionExists.c
    Linking C executable cmTryCompileExec2473426599
    /usr/local/bin/cmake -E cmake_link_script CMakeFiles/cmTryCompileExec2473426599.dir/link.txt --verbose=1
    /usr/bin/cc -Wall -DCHECK_FUNCTION_EXISTS=dlopen CMakeFiles/cmTryCompileExec2473426599.dir/CheckFunctionExists.c.o -o cmTryCompileExec2473426599 -rdynamic
    CMakeFiles/cmTryCompileExec2473426599.dir/CheckFunctionExists.c.o: In function `main':
    CheckFunctionExists.c:(.text+0x15): undefined reference to `dlopen'
    collect2: ld 返回 1
    gmake[1]: *** [cmTryCompileExec2473426599] 错误 1
    gmake[1]: Leaving directory `/root/lnmp/src/mysql-5.6.16/CMakeFiles/CMakeTmp'
    gmake: *** [cmTryCompileExec2473426599/fast] 错误 2


    Determining if the function clock_gettime exists failed with the following output:
    Change Dir: /root/lnmp/src/mysql-5.6.16/CMakeFiles/CMakeTmp

    Run Build Command:/usr/bin/gmake "cmTryCompileExec3285226529/fast"
    /usr/bin/gmake -f CMakeFiles/cmTryCompileExec3285226529.dir/build.make CMakeFiles/cmTryCompileExec3285226529.dir/build
    gmake[1]: Entering directory `/root/lnmp/src/mysql-5.6.16/CMakeFiles/CMakeTmp'
    /usr/local/bin/cmake -E cmake_progress_report /root/lnmp/src/mysql-5.6.16/CMakeFiles/CMakeTmp/CMakeFiles 1
    Building C object CMakeFiles/cmTryCompileExec3285226529.dir/CheckFunctionExists.c.o
    /usr/bin/cc -Wall -DCHECK_FUNCTION_EXISTS=clock_gettime -o CMakeFiles/cmTryCompileExec3285226529.dir/CheckFunctionExists.c.o -c /usr/local/share/cmake-2.8/Modules/CheckFunctionExists.c
    Linking C executable cmTryCompileExec3285226529
    /usr/local/bin/cmake -E cmake_link_script CMakeFiles/cmTryCompileExec3285226529.dir/link.txt --verbose=1
    /usr/bin/cc -Wall -DCHECK_FUNCTION_EXISTS=clock_gettime CMakeFiles/cmTryCompileExec3285226529.dir/CheckFunctionExists.c.o -o cmTryCompileExec3285226529 -rdynamic
    CMakeFiles/cmTryCompileExec3285226529.dir/CheckFunctionExists.c.o: In function `main':
    CheckFunctionExists.c:(.text+0x15): undefined reference to `clock_gettime'
    collect2: ld 返回 1
    gmake[1]: *** [cmTryCompileExec3285226529] 错误 1
    gmake[1]: Leaving directory `/root/lnmp/src/mysql-5.6.16/CMakeFiles/CMakeTmp'
    gmake: *** [cmTryCompileExec3285226529/fast] 错误 2


    Determining if the pthread_create exist failed with the following output:
    Change Dir: /root/lnmp/src/mysql-5.6.16/CMakeFiles/CMakeTmp

    Run Build Command:/usr/bin/gmake "cmTryCompileExec1680121675/fast"
    /usr/bin/gmake -f CMakeFiles/cmTryCompileExec1680121675.dir/build.make CMakeFiles/cmTryCompileExec1680121675.dir/build
    gmake[1]: Entering directory `/root/lnmp/src/mysql-5.6.16/CMakeFiles/CMakeTmp'
    /usr/local/bin/cmake -E cmake_progress_report /root/lnmp/src/mysql-5.6.16/CMakeFiles/CMakeTmp/CMakeFiles 1
    Building C object CMakeFiles/cmTryCompileExec1680121675.dir/CheckSymbolExists.c.o
    /usr/bin/cc -Wall -o CMakeFiles/cmTryCompileExec1680121675.dir/CheckSymbolExists.c.o -c /root/lnmp/src/mysql-5.6.16/CMakeFiles/CMakeTmp/CheckSymbolExists.c
    Linking C executable cmTryCompileExec1680121675
    /usr/local/bin/cmake -E cmake_link_script CMakeFiles/cmTryCompileExec1680121675.dir/link.txt --verbose=1
    /usr/bin/cc -Wall CMakeFiles/cmTryCompileExec1680121675.dir/CheckSymbolExists.c.o -o cmTryCompileExec1680121675 -rdynamic
    CMakeFiles/cmTryCompileExec1680121675.dir/CheckSymbolExists.c.o: In function `main':
    CheckSymbolExists.c:(.text+0xc): undefined reference to `pthread_create'
    collect2: ld 返回 1
    gmake[1]: *** [cmTryCompileExec1680121675] 错误 1
    gmake[1]: Leaving directory `/root/lnmp/src/mysql-5.6.16/CMakeFiles/CMakeTmp'
    gmake: *** [cmTryCompileExec1680121675/fast] 错误 2

    File /root/lnmp/src/mysql-5.6.16/CMakeFiles/CMakeTmp/CheckSymbolExists.c:
    /* */
    #include <pthread.h>

    int main(int argc, char** argv)
    {
    (void)argv;
    #ifndef pthread_create
    return ((int*)(&pthread_create))[argc];
    #else
    (void)argc;
    return 0;
    #endif
    }

    Determining if the function pthread_create exists in the pthreads failed with the following output:
    Change Dir: /root/lnmp/src/mysql-5.6.16/CMakeFiles/CMakeTmp

    Run Build Command:/usr/bin/gmake "cmTryCompileExec290233521/fast"
    /usr/bin/gmake -f CMakeFiles/cmTryCompileExec290233521.dir/build.make CMakeFiles/cmTryCompileExec290233521.dir/build
    gmake[1]: Entering directory `/root/lnmp/src/mysql-5.6.16/CMakeFiles/CMakeTmp'
    /usr/local/bin/cmake -E cmake_progress_report /root/lnmp/src/mysql-5.6.16/CMakeFiles/CMakeTmp/CMakeFiles 1
    Building C object CMakeFiles/cmTryCompileExec290233521.dir/CheckFunctionExists.c.o
    /usr/bin/cc -Wall -DCHECK_FUNCTION_EXISTS=pthread_create -o CMakeFiles/cmTryCompileExec290233521.dir/CheckFunctionExists.c.o -c /usr/local/share/cmake-2.8/Modules/CheckFunctionExists.c
    Linking C executable cmTryCompileExec290233521
    /usr/local/bin/cmake -E cmake_link_script CMakeFiles/cmTryCompileExec290233521.dir/link.txt --verbose=1
    /usr/bin/cc -Wall -DCHECK_FUNCTION_EXISTS=pthread_create CMakeFiles/cmTryCompileExec290233521.dir/CheckFunctionExists.c.o -o cmTryCompileExec290233521 -rdynamic -lpthreads
    /usr/bin/ld: cannot find -lpthreads
    collect2: ld 返回 1
    gmake[1]: *** [cmTryCompileExec290233521] 错误 1
    gmake[1]: Leaving directory `/root/lnmp/src/mysql-5.6.16/CMakeFiles/CMakeTmp'
    gmake: *** [cmTryCompileExec290233521/fast] 错误 2


    Determining if files cxxabi.h exist failed with the following output:
    Change Dir: /root/lnmp/src/mysql-5.6.16/CMakeFiles/CMakeTmp

    Run Build Command:/usr/bin/gmake "cmTryCompileExec3834282296/fast"
    /usr/bin/gmake -f CMakeFiles/cmTryCompileExec3834282296.dir/build.make CMakeFiles/cmTryCompileExec3834282296.dir/build
    gmake[1]: Entering directory `/root/lnmp/src/mysql-5.6.16/CMakeFiles/CMakeTmp'
    /usr/local/bin/cmake -E cmake_progress_report /root/lnmp/src/mysql-5.6.16/CMakeFiles/CMakeTmp/CMakeFiles 1
    Building C object CMakeFiles/cmTryCompileExec3834282296.dir/CheckIncludeFiles.c.o
    /usr/bin/cc -Wall -o CMakeFiles/cmTryCompileExec3834282296.dir/CheckIncludeFiles.c.o -c /root/lnmp/src/mysql-5.6.16/CMakeFiles/CMakeTmp/CheckIncludeFiles.c
    /root/lnmp/src/mysql-5.6.16/CMakeFiles/CMakeTmp/CheckIncludeFiles.c:2:20: 错误:cxxabi.h:没有那个文件或目录
    gmake[1]: *** [CMakeFiles/cmTryCompileExec3834282296.dir/CheckIncludeFiles.c.o] 错误 1
    gmake[1]: Leaving directory `/root/lnmp/src/mysql-5.6.16/CMakeFiles/CMakeTmp'
    gmake: *** [cmTryCompileExec3834282296/fast] 错误 2

    Source:
    /* */
    #include <cxxabi.h>


    int main(){return 0;}

    Determining if files floatingpoint.h exist failed with the following output:
    Change Dir: /root/lnmp/src/mysql-5.6.16/CMakeFiles/CMakeTmp

    Run Build Command:/usr/bin/gmake "cmTryCompileExec1491466689/fast"
    /usr/bin/gmake -f CMakeFiles/cmTryCompileExec1491466689.dir/build.make CMakeFiles/cmTryCompileExec1491466689.dir/build
    gmake[1]: Entering directory `/root/lnmp/src/mysql-5.6.16/CMakeFiles/CMakeTmp'
    /usr/local/bin/cmake -E cmake_progress_report /root/lnmp/src/mysql-5.6.16/CMakeFiles/CMakeTmp/CMakeFiles 1
    Building C object CMakeFiles/cmTryCompileExec1491466689.dir/CheckIncludeFiles.c.o
    /usr/bin/cc -Wall -o CMakeFiles/cmTryCompileExec1491466689.dir/CheckIncludeFiles.c.o -c /root/lnmp/src/mysql-5.6.16/CMakeFiles/CMakeTmp/CheckIncludeFiles.c
    /root/lnmp/src/mysql-5.6.16/CMakeFiles/CMakeTmp/CheckIncludeFiles.c:2:27: 错误:floatingpoint.h:没有那个文件或目录
    gmake[1]: *** [CMakeFiles/cmTryCompileExec1491466689.dir/CheckIncludeFiles.c.o] 错误 1
    gmake[1]: Leaving directory `/root/lnmp/src/mysql-5.6.16/CMakeFiles/CMakeTmp'
    gmake: *** [cmTryCompileExec1491466689/fast] 错误 2

    Source:
    /* */
    #include <floatingpoint.h>


    int main(){return 0;}

    Determining if files ieeefp.h exist failed with the following output:
    Change Dir: /root/lnmp/src/mysql-5.6.16/CMakeFiles/CMakeTmp

    Run Build Command:/usr/bin/gmake "cmTryCompileExec1316285371/fast"
    /usr/bin/gmake -f CMakeFiles/cmTryCompileExec1316285371.dir/build.make CMakeFiles/cmTryCompileExec1316285371.dir/build
    gmake[1]: Entering directory `/root/lnmp/src/mysql-5.6.16/CMakeFiles/CMakeTmp'
    /usr/local/bin/cmake -E cmake_progress_report /root/lnmp/src/mysql-5.6.16/CMakeFiles/CMakeTmp/CMakeFiles 1
    Building C object CMakeFiles/cmTryCompileExec1316285371.dir/CheckIncludeFiles.c.o
    /usr/bin/cc -Wall -o CMakeFiles/cmTryCompileExec1316285371.dir/CheckIncludeFiles.c.o -c /root/lnmp/src/mysql-5.6.16/CMakeFiles/CMakeTmp/CheckIncludeFiles.c
    /root/lnmp/src/mysql-5.6.16/CMakeFiles/CMakeTmp/CheckIncludeFiles.c:2:20: 错误:ieeefp.h:没有那个文件或目录
    gmake[1]: *** [CMakeFiles/cmTryCompileExec1316285371.dir/CheckIncludeFiles.c.o] 错误 1
    gmake[1]: Leaving directory `/root/lnmp/src/mysql-5.6.16/CMakeFiles/CMakeTmp'
    gmake: *** [cmTryCompileExec1316285371/fast] 错误 2

    Source:
    /* */
    #include <ieeefp.h>


    int main(){return 0;}

    Determining if files ndir.h exist failed with the following output:
    Change Dir: /root/lnmp/src/mysql-5.6.16/CMakeFiles/CMakeTmp

    Run Build Command:/usr/bin/gmake "cmTryCompileExec1833592807/fast"
    /usr/bin/gmake -f CMakeFiles/cmTryCompileExec1833592807.dir/build.make CMakeFiles/cmTryCompileExec1833592807.dir/build
    gmake[1]: Entering directory `/root/lnmp/src/mysql-5.6.16/CMakeFiles/CMakeTmp'
    /usr/local/bin/cmake -E cmake_progress_report /root/lnmp/src/mysql-5.6.16/CMakeFiles/CMakeTmp/CMakeFiles 1
    Building C object CMakeFiles/cmTryCompileExec1833592807.dir/CheckIncludeFiles.c.o
    /usr/bin/cc -Wall -o CMakeFiles/cmTryCompileExec1833592807.dir/CheckIncludeFiles.c.o -c /root/lnmp/src/mysql-5.6.16/CMakeFiles/CMakeTmp/CheckIncludeFiles.c
    /root/lnmp/src/mysql-5.6.16/CMakeFiles/CMakeTmp/CheckIncludeFiles.c:2:18: 错误:ndir.h:没有那个文件或目录
    gmake[1]: *** [CMakeFiles/cmTryCompileExec1833592807.dir/CheckIncludeFiles.c.o] 错误 1
    gmake[1]: Leaving directory `/root/lnmp/src/mysql-5.6.16/CMakeFiles/CMakeTmp'
    gmake: *** [cmTryCompileExec1833592807/fast] 错误 2

    Source:
    /* */
    #include <ndir.h>


    int main(){return 0;}

    Determining if files port.h exist failed with the following output:
    Change Dir: /root/lnmp/src/mysql-5.6.16/CMakeFiles/CMakeTmp

    Run Build Command:/usr/bin/gmake "cmTryCompileExec4284101461/fast"
    /usr/bin/gmake -f CMakeFiles/cmTryCompileExec4284101461.dir/build.make CMakeFiles/cmTryCompileExec4284101461.dir/build
    gmake[1]: Entering directory `/root/lnmp/src/mysql-5.6.16/CMakeFiles/CMakeTmp'
    /usr/local/bin/cmake -E cmake_progress_report /root/lnmp/src/mysql-5.6.16/CMakeFiles/CMakeTmp/CMakeFiles 1
    Building C object CMakeFiles/cmTryCompileExec4284101461.dir/CheckIncludeFiles.c.o
    /usr/bin/cc -Wall -o CMakeFiles/cmTryCompileExec4284101461.dir/CheckIncludeFiles.c.o -c /root/lnmp/src/mysql-5.6.16/CMakeFiles/CMakeTmp/CheckIncludeFiles.c
    /root/lnmp/src/mysql-5.6.16/CMakeFiles/CMakeTmp/CheckIncludeFiles.c:2:18: 错误:port.h:没有那个文件或目录
    gmake[1]: *** [CMakeFiles/cmTryCompileExec4284101461.dir/CheckIncludeFiles.c.o] 错误 1
    gmake[1]: Leaving directory `/root/lnmp/src/mysql-5.6.16/CMakeFiles/CMakeTmp'
    gmake: *** [cmTryCompileExec4284101461/fast] 错误 2

    Source:
    /* */
    #include <port.h>


    int main(){return 0;}

    Determining if files select.h exist failed with the following output:
    Change Dir: /root/lnmp/src/mysql-5.6.16/CMakeFiles/CMakeTmp

    Run Build Command:/usr/bin/gmake "cmTryCompileExec490043558/fast"
    /usr/bin/gmake -f CMakeFiles/cmTryCompileExec490043558.dir/build.make CMakeFiles/cmTryCompileExec490043558.dir/build
    gmake[1]: Entering directory `/root/lnmp/src/mysql-5.6.16/CMakeFiles/CMakeTmp'
    /usr/local/bin/cmake -E cmake_progress_report /root/lnmp/src/mysql-5.6.16/CMakeFiles/CMakeTmp/CMakeFiles 1
    Building C object CMakeFiles/cmTryCompileExec490043558.dir/CheckIncludeFiles.c.o
    /usr/bin/cc -Wall -o CMakeFiles/cmTryCompileExec490043558.dir/CheckIncludeFiles.c.o -c /root/lnmp/src/mysql-5.6.16/CMakeFiles/CMakeTmp/CheckIncludeFiles.c
    /root/lnmp/src/mysql-5.6.16/CMakeFiles/CMakeTmp/CheckIncludeFiles.c:2:20: 错误:select.h:没有那个文件或目录
    gmake[1]: *** [CMakeFiles/cmTryCompileExec490043558.dir/CheckIncludeFiles.c.o] 错误 1
    gmake[1]: Leaving directory `/root/lnmp/src/mysql-5.6.16/CMakeFiles/CMakeTmp'
    gmake: *** [cmTryCompileExec490043558/fast] 错误 2

    Source:
    /* */
    #include <select.h>


    int main(){return 0;}

    Determining if files sys/ndir.h exist failed with the following output:
    Change Dir: /root/lnmp/src/mysql-5.6.16/CMakeFiles/CMakeTmp

    Run Build Command:/usr/bin/gmake "cmTryCompileExec865721154/fast"
    /usr/bin/gmake -f CMakeFiles/cmTryCompileExec865721154.dir/build.make CMakeFiles/cmTryCompileExec865721154.dir/build
    gmake[1]: Entering directory `/root/lnmp/src/mysql-5.6.16/CMakeFiles/CMakeTmp'
    /usr/local/bin/cmake -E cmake_progress_report /root/lnmp/src/mysql-5.6.16/CMakeFiles/CMakeTmp/CMakeFiles 1
    Building C object CMakeFiles/cmTryCompileExec865721154.dir/CheckIncludeFiles.c.o
    /usr/bin/cc -Wall -o CMakeFiles/cmTryCompileExec865721154.dir/CheckIncludeFiles.c.o -c /root/lnmp/src/mysql-5.6.16/CMakeFiles/CMakeTmp/CheckIncludeFiles.c
    /root/lnmp/src/mysql-5.6.16/CMakeFiles/CMakeTmp/CheckIncludeFiles.c:2:22: 错误:sys/ndir.h:没有那个文件或目录
    gmake[1]: *** [CMakeFiles/cmTryCompileExec865721154.dir/CheckIncludeFiles.c.o] 错误 1
    gmake[1]: Leaving directory `/root/lnmp/src/mysql-5.6.16/CMakeFiles/CMakeTmp'
    gmake: *** [cmTryCompileExec865721154/fast] 错误 2

    Source:
    /* */
    #include <sys/ndir.h>


    int main(){return 0;}

    Determining if files sys/pte.h exist failed with the following output:
    Change Dir: /root/lnmp/src/mysql-5.6.16/CMakeFiles/CMakeTmp

    Run Build Command:/usr/bin/gmake "cmTryCompileExec1745379747/fast"
    /usr/bin/gmake -f CMakeFiles/cmTryCompileExec1745379747.dir/build.make CMakeFiles/cmTryCompileExec1745379747.dir/build
    gmake[1]: Entering directory `/root/lnmp/src/mysql-5.6.16/CMakeFiles/CMakeTmp'
    /usr/local/bin/cmake -E cmake_progress_report /root/lnmp/src/mysql-5.6.16/CMakeFiles/CMakeTmp/CMakeFiles 1
    Building C object CMakeFiles/cmTryCompileExec1745379747.dir/CheckIncludeFiles.c.o
    /usr/bin/cc -Wall -o CMakeFiles/cmTryCompileExec1745379747.dir/CheckIncludeFiles.c.o -c /root/lnmp/src/mysql-5.6.16/CMakeFiles/CMakeTmp/CheckIncludeFiles.c
    /root/lnmp/src/mysql-5.6.16/CMakeFiles/CMakeTmp/CheckIncludeFiles.c:2:21: 错误:sys/pte.h:没有那个文件或目录
    gmake[1]: *** [CMakeFiles/cmTryCompileExec1745379747.dir/CheckIncludeFiles.c.o] 错误 1
    gmake[1]: Leaving directory `/root/lnmp/src/mysql-5.6.16/CMakeFiles/CMakeTmp'
    gmake: *** [cmTryCompileExec1745379747/fast] 错误 2

    Source:
    /* */
    #include <sys/pte.h>


    int main(){return 0;}

    Determining if files synch.h exist failed with the following output:
    Change Dir: /root/lnmp/src/mysql-5.6.16/CMakeFiles/CMakeTmp

    Run Build Command:/usr/bin/gmake "cmTryCompileExec155575419/fast"
    /usr/bin/gmake -f CMakeFiles/cmTryCompileExec155575419.dir/build.make CMakeFiles/cmTryCompileExec155575419.dir/build
    gmake[1]: Entering directory `/root/lnmp/src/mysql-5.6.16/CMakeFiles/CMakeTmp'
    /usr/local/bin/cmake -E cmake_progress_report /root/lnmp/src/mysql-5.6.16/CMakeFiles/CMakeTmp/CMakeFiles 1
    Building C object CMakeFiles/cmTryCompileExec155575419.dir/CheckIncludeFiles.c.o
    /usr/bin/cc -Wall -o CMakeFiles/cmTryCompileExec155575419.dir/CheckIncludeFiles.c.o -c /root/lnmp/src/mysql-5.6.16/CMakeFiles/CMakeTmp/CheckIncludeFiles.c
    /root/lnmp/src/mysql-5.6.16/CMakeFiles/CMakeTmp/CheckIncludeFiles.c:2:19: 错误:synch.h:没有那个文件或目录
    gmake[1]: *** [CMakeFiles/cmTryCompileExec155575419.dir/CheckIncludeFiles.c.o] 错误 1
    gmake[1]: Leaving directory `/root/lnmp/src/mysql-5.6.16/CMakeFiles/CMakeTmp'
    gmake: *** [cmTryCompileExec155575419/fast] 错误 2

    Source:
    /* */
    #include <synch.h>


    int main(){return 0;}

    Determining if files sysent.h exist failed with the following output:
    Change Dir: /root/lnmp/src/mysql-5.6.16/CMakeFiles/CMakeTmp

    Run Build Command:/usr/bin/gmake "cmTryCompileExec3314332937/fast"
    /usr/bin/gmake -f CMakeFiles/cmTryCompileExec3314332937.dir/build.make CMakeFiles/cmTryCompileExec3314332937.dir/build
    gmake[1]: Entering directory `/root/lnmp/src/mysql-5.6.16/CMakeFiles/CMakeTmp'
    /usr/local/bin/cmake -E cmake_progress_report /root/lnmp/src/mysql-5.6.16/CMakeFiles/CMakeTmp/CMakeFiles 1
    Building C object CMakeFiles/cmTryCompileExec3314332937.dir/CheckIncludeFiles.c.o
    /usr/bin/cc -Wall -o CMakeFiles/cmTryCompileExec3314332937.dir/CheckIncludeFiles.c.o -c /root/lnmp/src/mysql-5.6.16/CMakeFiles/CMakeTmp/CheckIncludeFiles.c
    /root/lnmp/src/mysql-5.6.16/CMakeFiles/CMakeTmp/CheckIncludeFiles.c:2:20: 错误:sysent.h:没有那个文件或目录
    gmake[1]: *** [CMakeFiles/cmTryCompileExec3314332937.dir/CheckIncludeFiles.c.o] 错误 1
    gmake[1]: Leaving directory `/root/lnmp/src/mysql-5.6.16/CMakeFiles/CMakeTmp'
    gmake: *** [cmTryCompileExec3314332937/fast] 错误 2

    Source:
    /* */
    #include <sysent.h>


    int main(){return 0;}

    Determining if files sys/fpu.h exist failed with the following output:
    Change Dir: /root/lnmp/src/mysql-5.6.16/CMakeFiles/CMakeTmp

    Run Build Command:/usr/bin/gmake "cmTryCompileExec2581111344/fast"
    /usr/bin/gmake -f CMakeFiles/cmTryCompileExec2581111344.dir/build.make CMakeFiles/cmTryCompileExec2581111344.dir/build
    gmake[1]: Entering directory `/root/lnmp/src/mysql-5.6.16/CMakeFiles/CMakeTmp'
    /usr/local/bin/cmake -E cmake_progress_report /root/lnmp/src/mysql-5.6.16/CMakeFiles/CMakeTmp/CMakeFiles 1
    Building C object CMakeFiles/cmTryCompileExec2581111344.dir/CheckIncludeFiles.c.o
    /usr/bin/cc -Wall -o CMakeFiles/cmTryCompileExec2581111344.dir/CheckIncludeFiles.c.o -c /root/lnmp/src/mysql-5.6.16/CMakeFiles/CMakeTmp/CheckIncludeFiles.c
    /root/lnmp/src/mysql-5.6.16/CMakeFiles/CMakeTmp/CheckIncludeFiles.c:2:21: 错误:sys/fpu.h:没有那个文件或目录
    gmake[1]: Leaving directory `/root/lnmp/src/mysql-5.6.16/CMakeFiles/CMakeTmp'
    gmake[1]: *** [CMakeFiles/cmTryCompileExec2581111344.dir/CheckIncludeFiles.c.o] 错误 1
    gmake: *** [cmTryCompileExec2581111344/fast] 错误 2

    Source:
    /* */
    #include <sys/fpu.h>


    int main(){return 0;}

    Determining if files sys/malloc.h exist failed with the following output:
    Change Dir: /root/lnmp/src/mysql-5.6.16/CMakeFiles/CMakeTmp

    Run Build Command:/usr/bin/gmake "cmTryCompileExec1005842944/fast"
    /usr/bin/gmake -f CMakeFiles/cmTryCompileExec1005842944.dir/build.make CMakeFiles/cmTryCompileExec1005842944.dir/build
    gmake[1]: Entering directory `/root/lnmp/src/mysql-5.6.16/CMakeFiles/CMakeTmp'
    /usr/local/bin/cmake -E cmake_progress_report /root/lnmp/src/mysql-5.6.16/CMakeFiles/CMakeTmp/CMakeFiles 1
    Building C object CMakeFiles/cmTryCompileExec1005842944.dir/CheckIncludeFiles.c.o
    /usr/bin/cc -Wall -o CMakeFiles/cmTryCompileExec1005842944.dir/CheckIncludeFiles.c.o -c /root/lnmp/src/mysql-5.6.16/CMakeFiles/CMakeTmp/CheckIncludeFiles.c
    /root/lnmp/src/mysql-5.6.16/CMakeFiles/CMakeTmp/CheckIncludeFiles.c:2:24: 错误:sys/malloc.h:没有那个文件或目录
    gmake[1]: *** [CMakeFiles/cmTryCompileExec1005842944.dir/CheckIncludeFiles.c.o] 错误 1
    gmake[1]: Leaving directory `/root/lnmp/src/mysql-5.6.16/CMakeFiles/CMakeTmp'
    gmake: *** [cmTryCompileExec1005842944/fast] 错误 2

    Source:
    /* */
    #include <sys/malloc.h>


    int main(){return 0;}

    Determining if files sys/stream.h exist failed with the following output:
    Change Dir: /root/lnmp/src/mysql-5.6.16/CMakeFiles/CMakeTmp

    Run Build Command:/usr/bin/gmake "cmTryCompileExec1901989764/fast"
    /usr/bin/gmake -f CMakeFiles/cmTryCompileExec1901989764.dir/build.make CMakeFiles/cmTryCompileExec1901989764.dir/build
    gmake[1]: Entering directory `/root/lnmp/src/mysql-5.6.16/CMakeFiles/CMakeTmp'
    /usr/local/bin/cmake -E cmake_progress_report /root/lnmp/src/mysql-5.6.16/CMakeFiles/CMakeTmp/CMakeFiles 1
    Building C object CMakeFiles/cmTryCompileExec1901989764.dir/CheckIncludeFiles.c.o
    /usr/bin/cc -Wall -o CMakeFiles/cmTryCompileExec1901989764.dir/CheckIncludeFiles.c.o -c /root/lnmp/src/mysql-5.6.16/CMakeFiles/CMakeTmp/CheckIncludeFiles.c
    /root/lnmp/src/mysql-5.6.16/CMakeFiles/CMakeTmp/CheckIncludeFiles.c:2:24: 错误:sys/stream.h:没有那个文件或目录
    gmake[1]: *** [CMakeFiles/cmTryCompileExec1901989764.dir/CheckIncludeFiles.c.o] 错误 1
    gmake[1]: Leaving directory `/root/lnmp/src/mysql-5.6.16/CMakeFiles/CMakeTmp'
    gmake: *** [cmTryCompileExec1901989764/fast] 错误 2

    Source:
    /* */
    #include <sys/stream.h>


    int main(){return 0;}

    Determining if files sys/termcap.h exist failed with the following output:
    Change Dir: /root/lnmp/src/mysql-5.6.16/CMakeFiles/CMakeTmp

    Run Build Command:/usr/bin/gmake "cmTryCompileExec1970883380/fast"
    /usr/bin/gmake -f CMakeFiles/cmTryCompileExec1970883380.dir/build.make CMakeFiles/cmTryCompileExec1970883380.dir/build
    gmake[1]: Entering directory `/root/lnmp/src/mysql-5.6.16/CMakeFiles/CMakeTmp'
    /usr/local/bin/cmake -E cmake_progress_report /root/lnmp/src/mysql-5.6.16/CMakeFiles/CMakeTmp/CMakeFiles 1
    Building C object CMakeFiles/cmTryCompileExec1970883380.dir/CheckIncludeFiles.c.o
    /usr/bin/cc -Wall -o CMakeFiles/cmTryCompileExec1970883380.dir/CheckIncludeFiles.c.o -c /root/lnmp/src/mysql-5.6.16/CMakeFiles/CMakeTmp/CheckIncludeFiles.c
    /root/lnmp/src/mysql-5.6.16/CMakeFiles/CMakeTmp/CheckIncludeFiles.c:2:25: 错误:sys/termcap.h:没有那个文件或目录
    gmake[1]: *** [CMakeFiles/cmTryCompileExec1970883380.dir/CheckIncludeFiles.c.o] 错误 1
    gmake[1]: Leaving directory `/root/lnmp/src/mysql-5.6.16/CMakeFiles/CMakeTmp'
    gmake: *** [cmTryCompileExec1970883380/fast] 错误 2

    Source:
    /* */
    #include <sys/termcap.h>


    int main(){return 0;}

    Determining if files termbits.h exist failed with the following output:
    Change Dir: /root/lnmp/src/mysql-5.6.16/CMakeFiles/CMakeTmp

    Run Build Command:/usr/bin/gmake "cmTryCompileExec1974579698/fast"
    /usr/bin/gmake -f CMakeFiles/cmTryCompileExec1974579698.dir/build.make CMakeFiles/cmTryCompileExec1974579698.dir/build
    gmake[1]: Entering directory `/root/lnmp/src/mysql-5.6.16/CMakeFiles/CMakeTmp'
    /usr/local/bin/cmake -E cmake_progress_report /root/lnmp/src/mysql-5.6.16/CMakeFiles/CMakeTmp/CMakeFiles 1
    Building C object CMakeFiles/cmTryCompileExec1974579698.dir/CheckIncludeFiles.c.o
    /usr/bin/cc -Wall -o CMakeFiles/cmTryCompileExec1974579698.dir/CheckIncludeFiles.c.o -c /root/lnmp/src/mysql-5.6.16/CMakeFiles/CMakeTmp/CheckIncludeFiles.c
    /root/lnmp/src/mysql-5.6.16/CMakeFiles/CMakeTmp/CheckIncludeFiles.c:2:22: 错误:termbits.h:没有那个文件或目录
    gmake[1]: *** [CMakeFiles/cmTryCompileExec1974579698.dir/CheckIncludeFiles.c.o] 错误 1
    gmake[1]: Leaving directory `/root/lnmp/src/mysql-5.6.16/CMakeFiles/CMakeTmp'
    gmake: *** [cmTryCompileExec1974579698/fast] 错误 2

    Source:
    /* */
    #include <termbits.h>


    int main(){return 0;}

    Determining if files varargs.h exist failed with the following output:
    Change Dir: /root/lnmp/src/mysql-5.6.16/CMakeFiles/CMakeTmp

    Run Build Command:/usr/bin/gmake "cmTryCompileExec3038199047/fast"
    /usr/bin/gmake -f CMakeFiles/cmTryCompileExec3038199047.dir/build.make CMakeFiles/cmTryCompileExec3038199047.dir/build
    gmake[1]: Entering directory `/root/lnmp/src/mysql-5.6.16/CMakeFiles/CMakeTmp'
    /usr/local/bin/cmake -E cmake_progress_report /root/lnmp/src/mysql-5.6.16/CMakeFiles/CMakeTmp/CMakeFiles 1
    Building C object CMakeFiles/cmTryCompileExec3038199047.dir/CheckIncludeFiles.c.o
    /usr/bin/cc -Wall -o CMakeFiles/cmTryCompileExec3038199047.dir/CheckIncludeFiles.c.o -c /root/lnmp/src/mysql-5.6.16/CMakeFiles/CMakeTmp/CheckIncludeFiles.c
    在包含自 /root/lnmp/src/mysql-5.6.16/CMakeFiles/CMakeTmp/CheckIncludeFiles.c:2 的文件中:
    /usr/lib/gcc/x86_64-redhat-linux/4.4.7/include/varargs.h:4:2: 错误:#error "GCC no longer implements <varargs.h>."
    /usr/lib/gcc/x86_64-redhat-linux/4.4.7/include/varargs.h:5:2: 错误:#error "Revise your code to use <stdarg.h>."
    gmake[1]: *** [CMakeFiles/cmTryCompileExec3038199047.dir/CheckIncludeFiles.c.o] 错误 1
    gmake[1]: Leaving directory `/root/lnmp/src/mysql-5.6.16/CMakeFiles/CMakeTmp'
    gmake: *** [cmTryCompileExec3038199047/fast] 错误 2

    Source:
    /* */
    #include <varargs.h>


    int main(){return 0;}

    Determining if files sys/utime.h exist failed with the following output:
    Change Dir: /root/lnmp/src/mysql-5.6.16/CMakeFiles/CMakeTmp

    Run Build Command:/usr/bin/gmake "cmTryCompileExec2271533760/fast"
    /usr/bin/gmake -f CMakeFiles/cmTryCompileExec2271533760.dir/build.make CMakeFiles/cmTryCompileExec2271533760.dir/build
    gmake[1]: Entering directory `/root/lnmp/src/mysql-5.6.16/CMakeFiles/CMakeTmp'
    /usr/local/bin/cmake -E cmake_progress_report /root/lnmp/src/mysql-5.6.16/CMakeFiles/CMakeTmp/CMakeFiles 1
    Building C object CMakeFiles/cmTryCompileExec2271533760.dir/CheckIncludeFiles.c.o
    /usr/bin/cc -Wall -o CMakeFiles/cmTryCompileExec2271533760.dir/CheckIncludeFiles.c.o -c /root/lnmp/src/mysql-5.6.16/CMakeFiles/CMakeTmp/CheckIncludeFiles.c
    /root/lnmp/src/mysql-5.6.16/CMakeFiles/CMakeTmp/CheckIncludeFiles.c:2:23: 错误:sys/utime.h:没有那个文件或目录
    gmake[1]: *** [CMakeFiles/cmTryCompileExec2271533760.dir/CheckIncludeFiles.c.o] 错误 1
    gmake[1]: Leaving directory `/root/lnmp/src/mysql-5.6.16/CMakeFiles/CMakeTmp'
    gmake: *** [cmTryCompileExec2271533760/fast] 错误 2

    Source:
    /* */
    #include <sys/utime.h>


    int main(){return 0;}

    Determining if files sys/vadvise.h exist failed with the following output:
    Change Dir: /root/lnmp/src/mysql-5.6.16/CMakeFiles/CMakeTmp

    Run Build Command:/usr/bin/gmake "cmTryCompileExec2066046440/fast"
    /usr/bin/gmake -f CMakeFiles/cmTryCompileExec2066046440.dir/build.make CMakeFiles/cmTryCompileExec2066046440.dir/build
    gmake[1]: Entering directory `/root/lnmp/src/mysql-5.6.16/CMakeFiles/CMakeTmp'
    /usr/local/bin/cmake -E cmake_progress_report /root/lnmp/src/mysql-5.6.16/CMakeFiles/CMakeTmp/CMakeFiles 1
    Building C object CMakeFiles/cmTryCompileExec2066046440.dir/CheckIncludeFiles.c.o
    /usr/bin/cc -Wall -o CMakeFiles/cmTryCompileExec2066046440.dir/CheckIncludeFiles.c.o -c /root/lnmp/src/mysql-5.6.16/CMakeFiles/CMakeTmp/CheckIncludeFiles.c
    /root/lnmp/src/mysql-5.6.16/CMakeFiles/CMakeTmp/CheckIncludeFiles.c:2:25: 错误:sys/vadvise.h:没有那个文件或目录
    gmake[1]: *** [CMakeFiles/cmTryCompileExec2066046440.dir/CheckIncludeFiles.c.o] 错误 1
    gmake[1]: Leaving directory `/root/lnmp/src/mysql-5.6.16/CMakeFiles/CMakeTmp'
    gmake: *** [cmTryCompileExec2066046440/fast] 错误 2

    Source:
    /* */
    #include <sys/vadvise.h>


    int main(){return 0;}

    Determining if files vis.h exist failed with the following output:
    Change Dir: /root/lnmp/src/mysql-5.6.16/CMakeFiles/CMakeTmp

    Run Build Command:/usr/bin/gmake "cmTryCompileExec3777360231/fast"
    /usr/bin/gmake -f CMakeFiles/cmTryCompileExec3777360231.dir/build.make CMakeFiles/cmTryCompileExec3777360231.dir/build
    gmake[1]: Entering directory `/root/lnmp/src/mysql-5.6.16/CMakeFiles/CMakeTmp'
    /usr/local/bin/cmake -E cmake_progress_report /root/lnmp/src/mysql-5.6.16/CMakeFiles/CMakeTmp/CMakeFiles 1
    Building C object CMakeFiles/cmTryCompileExec3777360231.dir/CheckIncludeFiles.c.o
    /usr/bin/cc -Wall -o CMakeFiles/cmTryCompileExec3777360231.dir/CheckIncludeFiles.c.o -c /root/lnmp/src/mysql-5.6.16/CMakeFiles/CMakeTmp/CheckIncludeFiles.c
    /root/lnmp/src/mysql-5.6.16/CMakeFiles/CMakeTmp/CheckIncludeFiles.c:2:17: 错误:vis.h:没有那个文件或目录
    gmake[1]: *** [CMakeFiles/cmTryCompileExec3777360231.dir/CheckIncludeFiles.c.o] 错误 1
    gmake[1]: Leaving directory `/root/lnmp/src/mysql-5.6.16/CMakeFiles/CMakeTmp'
    gmake: *** [cmTryCompileExec3777360231/fast] 错误 2

    Source:
    /* */
    #include <vis.h>


    int main(){return 0;}

    Determining if files sasl/sasl.h exist failed with the following output:
    Change Dir: /root/lnmp/src/mysql-5.6.16/CMakeFiles/CMakeTmp

    Run Build Command:/usr/bin/gmake "cmTryCompileExec3062584539/fast"
    /usr/bin/gmake -f CMakeFiles/cmTryCompileExec3062584539.dir/build.make CMakeFiles/cmTryCompileExec3062584539.dir/build
    gmake[1]: Entering directory `/root/lnmp/src/mysql-5.6.16/CMakeFiles/CMakeTmp'
    /usr/local/bin/cmake -E cmake_progress_report /root/lnmp/src/mysql-5.6.16/CMakeFiles/CMakeTmp/CMakeFiles 1
    Building C object CMakeFiles/cmTryCompileExec3062584539.dir/CheckIncludeFiles.c.o
    /usr/bin/cc -Wall -o CMakeFiles/cmTryCompileExec3062584539.dir/CheckIncludeFiles.c.o -c /root/lnmp/src/mysql-5.6.16/CMakeFiles/CMakeTmp/CheckIncludeFiles.c
    /root/lnmp/src/mysql-5.6.16/CMakeFiles/CMakeTmp/CheckIncludeFiles.c:2:23: 错误:sasl/sasl.h:没有那个文件或目录
    gmake[1]: *** [CMakeFiles/cmTryCompileExec3062584539.dir/CheckIncludeFiles.c.o] 错误 1
    gmake[1]: Leaving directory `/root/lnmp/src/mysql-5.6.16/CMakeFiles/CMakeTmp'
    gmake: *** [cmTryCompileExec3062584539/fast] 错误 2

    Source:
    /* */
    #include <sasl/sasl.h>


    int main(){return 0;}

    Determining if files sys/devpoll.h exist failed with the following output:
    Change Dir: /root/lnmp/src/mysql-5.6.16/CMakeFiles/CMakeTmp

    Run Build Command:/usr/bin/gmake "cmTryCompileExec616465264/fast"
    /usr/bin/gmake -f CMakeFiles/cmTryCompileExec616465264.dir/build.make CMakeFiles/cmTryCompileExec616465264.dir/build
    gmake[1]: Entering directory `/root/lnmp/src/mysql-5.6.16/CMakeFiles/CMakeTmp'
    /usr/local/bin/cmake -E cmake_progress_report /root/lnmp/src/mysql-5.6.16/CMakeFiles/CMakeTmp/CMakeFiles 1
    Building C object CMakeFiles/cmTryCompileExec616465264.dir/CheckIncludeFiles.c.o
    /usr/bin/cc -Wall -o CMakeFiles/cmTryCompileExec616465264.dir/CheckIncludeFiles.c.o -c /root/lnmp/src/mysql-5.6.16/CMakeFiles/CMakeTmp/CheckIncludeFiles.c
    /root/lnmp/src/mysql-5.6.16/CMakeFiles/CMakeTmp/CheckIncludeFiles.c:2:25: 错误:sys/devpoll.h:没有那个文件或目录
    gmake[1]: *** [CMakeFiles/cmTryCompileExec616465264.dir/CheckIncludeFiles.c.o] 错误 1
    gmake[1]: Leaving directory `/root/lnmp/src/mysql-5.6.16/CMakeFiles/CMakeTmp'
    gmake: *** [cmTryCompileExec616465264/fast] 错误 2

    Source:
    /* */
    #include <sys/devpoll.h>


    int main(){return 0;}

    Determining if files sys/devpoll.h exist failed with the following output:
    Change Dir: /root/lnmp/src/mysql-5.6.16/CMakeFiles/CMakeTmp

    Run Build Command:/usr/bin/gmake "cmTryCompileExec2845019247/fast"
    /usr/bin/gmake -f CMakeFiles/cmTryCompileExec2845019247.dir/build.make CMakeFiles/cmTryCompileExec2845019247.dir/build
    gmake[1]: Entering directory `/root/lnmp/src/mysql-5.6.16/CMakeFiles/CMakeTmp'
    /usr/local/bin/cmake -E cmake_progress_report /root/lnmp/src/mysql-5.6.16/CMakeFiles/CMakeTmp/CMakeFiles 1
    Building C object CMakeFiles/cmTryCompileExec2845019247.dir/CheckIncludeFiles.c.o
    /usr/bin/cc -Wall -o CMakeFiles/cmTryCompileExec2845019247.dir/CheckIncludeFiles.c.o -c /root/lnmp/src/mysql-5.6.16/CMakeFiles/CMakeTmp/CheckIncludeFiles.c
    /root/lnmp/src/mysql-5.6.16/CMakeFiles/CMakeTmp/CheckIncludeFiles.c:2:25: 错误:sys/devpoll.h:没有那个文件或目录
    gmake[1]: *** [CMakeFiles/cmTryCompileExec2845019247.dir/CheckIncludeFiles.c.o] 错误 1
    gmake[1]: Leaving directory `/root/lnmp/src/mysql-5.6.16/CMakeFiles/CMakeTmp'
    gmake: *** [cmTryCompileExec2845019247/fast] 错误 2

    Source:
    /* */
    #include <sys/devpoll.h>


    int main(){return 0;}

    Determining if files sys/event.h exist failed with the following output:
    Change Dir: /root/lnmp/src/mysql-5.6.16/CMakeFiles/CMakeTmp

    Run Build Command:/usr/bin/gmake "cmTryCompileExec4263980029/fast"
    /usr/bin/gmake -f CMakeFiles/cmTryCompileExec4263980029.dir/build.make CMakeFiles/cmTryCompileExec4263980029.dir/build
    gmake[1]: Entering directory `/root/lnmp/src/mysql-5.6.16/CMakeFiles/CMakeTmp'
    /usr/local/bin/cmake -E cmake_progress_report /root/lnmp/src/mysql-5.6.16/CMakeFiles/CMakeTmp/CMakeFiles 1
    Building C object CMakeFiles/cmTryCompileExec4263980029.dir/CheckIncludeFiles.c.o
    /usr/bin/cc -Wall -o CMakeFiles/cmTryCompileExec4263980029.dir/CheckIncludeFiles.c.o -c /root/lnmp/src/mysql-5.6.16/CMakeFiles/CMakeTmp/CheckIncludeFiles.c
    /root/lnmp/src/mysql-5.6.16/CMakeFiles/CMakeTmp/CheckIncludeFiles.c:2:23: 错误:sys/event.h:没有那个文件或目录
    gmake[1]: *** [CMakeFiles/cmTryCompileExec4263980029.dir/CheckIncludeFiles.c.o] 错误 1
    gmake[1]: Leaving directory `/root/lnmp/src/mysql-5.6.16/CMakeFiles/CMakeTmp'
    gmake: *** [cmTryCompileExec4263980029/fast] 错误 2

    Source:
    /* */
    #include <sys/event.h>


    int main(){return 0;}

    Determining if files sys/ptem.h exist failed with the following output:
    Change Dir: /root/lnmp/src/mysql-5.6.16/CMakeFiles/CMakeTmp

    Run Build Command:/usr/bin/gmake "cmTryCompileExec1945156033/fast"
    /usr/bin/gmake -f CMakeFiles/cmTryCompileExec1945156033.dir/build.make CMakeFiles/cmTryCompileExec1945156033.dir/build
    gmake[1]: Entering directory `/root/lnmp/src/mysql-5.6.16/CMakeFiles/CMakeTmp'
    /usr/local/bin/cmake -E cmake_progress_report /root/lnmp/src/mysql-5.6.16/CMakeFiles/CMakeTmp/CMakeFiles 1
    Building C object CMakeFiles/cmTryCompileExec1945156033.dir/CheckIncludeFiles.c.o
    /usr/bin/cc -Wall -o CMakeFiles/cmTryCompileExec1945156033.dir/CheckIncludeFiles.c.o -c /root/lnmp/src/mysql-5.6.16/CMakeFiles/CMakeTmp/CheckIncludeFiles.c
    /root/lnmp/src/mysql-5.6.16/CMakeFiles/CMakeTmp/CheckIncludeFiles.c:2:22: 错误:sys/ptem.h:没有那个文件或目录
    gmake[1]: *** [CMakeFiles/cmTryCompileExec1945156033.dir/CheckIncludeFiles.c.o] 错误 1
    gmake[1]: Leaving directory `/root/lnmp/src/mysql-5.6.16/CMakeFiles/CMakeTmp'
    gmake: *** [cmTryCompileExec1945156033/fast] 错误 2

    Source:
    /* */
    #include <sys/ptem.h>


    int main(){return 0;}

    Determining if the function _aligned_malloc exists failed with the following output:
    Change Dir: /root/lnmp/src/mysql-5.6.16/CMakeFiles/CMakeTmp

    Run Build Command:/usr/bin/gmake "cmTryCompileExec3623388014/fast"
    /usr/bin/gmake -f CMakeFiles/cmTryCompileExec3623388014.dir/build.make CMakeFiles/cmTryCompileExec3623388014.dir/build
    gmake[1]: Entering directory `/root/lnmp/src/mysql-5.6.16/CMakeFiles/CMakeTmp'
    /usr/local/bin/cmake -E cmake_progress_report /root/lnmp/src/mysql-5.6.16/CMakeFiles/CMakeTmp/CMakeFiles 1
    Building C object CMakeFiles/cmTryCompileExec3623388014.dir/CheckFunctionExists.c.o
    /usr/bin/cc -Wall -DCHECK_FUNCTION_EXISTS=_aligned_malloc -o CMakeFiles/cmTryCompileExec3623388014.dir/CheckFunctionExists.c.o -c /usr/local/share/cmake-2.8/Modules/CheckFunctionExists.c
    Linking C executable cmTryCompileExec3623388014
    /usr/local/bin/cmake -E cmake_link_script CMakeFiles/cmTryCompileExec3623388014.dir/link.txt --verbose=1
    /usr/bin/cc -Wall -DCHECK_FUNCTION_EXISTS=_aligned_malloc CMakeFiles/cmTryCompileExec3623388014.dir/CheckFunctionExists.c.o -o cmTryCompileExec3623388014 -rdynamic -lm -lcrypt -ldl -lpthread -lrt
    CMakeFiles/cmTryCompileExec3623388014.dir/CheckFunctionExists.c.o: In function `main':
    CheckFunctionExists.c:(.text+0x15): undefined reference to `_aligned_malloc'
    collect2: ld 返回 1
    gmake[1]: *** [cmTryCompileExec3623388014] 错误 1
    gmake[1]: Leaving directory `/root/lnmp/src/mysql-5.6.16/CMakeFiles/CMakeTmp'
    gmake: *** [cmTryCompileExec3623388014/fast] 错误 2


    Determining if the function _aligned_free exists failed with the following output:
    Change Dir: /root/lnmp/src/mysql-5.6.16/CMakeFiles/CMakeTmp

    Run Build Command:/usr/bin/gmake "cmTryCompileExec3326198802/fast"
    /usr/bin/gmake -f CMakeFiles/cmTryCompileExec3326198802.dir/build.make CMakeFiles/cmTryCompileExec3326198802.dir/build
    gmake[1]: Entering directory `/root/lnmp/src/mysql-5.6.16/CMakeFiles/CMakeTmp'
    /usr/local/bin/cmake -E cmake_progress_report /root/lnmp/src/mysql-5.6.16/CMakeFiles/CMakeTmp/CMakeFiles 1
    Building C object CMakeFiles/cmTryCompileExec3326198802.dir/CheckFunctionExists.c.o
    /usr/bin/cc -Wall -DCHECK_FUNCTION_EXISTS=_aligned_free -o CMakeFiles/cmTryCompileExec3326198802.dir/CheckFunctionExists.c.o -c /usr/local/share/cmake-2.8/Modules/CheckFunctionExists.c
    Linking C executable cmTryCompileExec3326198802
    /usr/local/bin/cmake -E cmake_link_script CMakeFiles/cmTryCompileExec3326198802.dir/link.txt --verbose=1
    /usr/bin/cc -Wall -DCHECK_FUNCTION_EXISTS=_aligned_free CMakeFiles/cmTryCompileExec3326198802.dir/CheckFunctionExists.c.o -o cmTryCompileExec3326198802 -rdynamic -lm -lcrypt -ldl -lpthread -lrt
    CMakeFiles/cmTryCompileExec3326198802.dir/CheckFunctionExists.c.o: In function `main':
    CheckFunctionExists.c:(.text+0x15): undefined reference to `_aligned_free'
    collect2: ld 返回 1
    gmake[1]: *** [cmTryCompileExec3326198802] 错误 1
    gmake[1]: Leaving directory `/root/lnmp/src/mysql-5.6.16/CMakeFiles/CMakeTmp'
    gmake: *** [cmTryCompileExec3326198802/fast] 错误 2


    Determining if the function printstack exists failed with the following output:
    Change Dir: /root/lnmp/src/mysql-5.6.16/CMakeFiles/CMakeTmp

    Run Build Command:/usr/bin/gmake "cmTryCompileExec3786035036/fast"
    /usr/bin/gmake -f CMakeFiles/cmTryCompileExec3786035036.dir/build.make CMakeFiles/cmTryCompileExec3786035036.dir/build
    gmake[1]: Entering directory `/root/lnmp/src/mysql-5.6.16/CMakeFiles/CMakeTmp'
    /usr/local/bin/cmake -E cmake_progress_report /root/lnmp/src/mysql-5.6.16/CMakeFiles/CMakeTmp/CMakeFiles 1
    Building C object CMakeFiles/cmTryCompileExec3786035036.dir/CheckFunctionExists.c.o
    /usr/bin/cc -Wall -DCHECK_FUNCTION_EXISTS=printstack -o CMakeFiles/cmTryCompileExec3786035036.dir/CheckFunctionExists.c.o -c /usr/local/share/cmake-2.8/Modules/CheckFunctionExists.c
    Linking C executable cmTryCompileExec3786035036
    /usr/local/bin/cmake -E cmake_link_script CMakeFiles/cmTryCompileExec3786035036.dir/link.txt --verbose=1
    /usr/bin/cc -Wall -DCHECK_FUNCTION_EXISTS=printstack CMakeFiles/cmTryCompileExec3786035036.dir/CheckFunctionExists.c.o -o cmTryCompileExec3786035036 -rdynamic -lm -lcrypt -ldl -lpthread -lrt
    CMakeFiles/cmTryCompileExec3786035036.dir/CheckFunctionExists.c.o: In function `main':
    CheckFunctionExists.c:(.text+0x15): undefined reference to `printstack'
    collect2: ld 返回 1
    gmake[1]: *** [cmTryCompileExec3786035036] 错误 1
    gmake[1]: Leaving directory `/root/lnmp/src/mysql-5.6.16/CMakeFiles/CMakeTmp'
    gmake: *** [cmTryCompileExec3786035036/fast] 错误 2


    Determining if the function bmove exists failed with the following output:
    Change Dir: /root/lnmp/src/mysql-5.6.16/CMakeFiles/CMakeTmp

    Run Build Command:/usr/bin/gmake "cmTryCompileExec1974002327/fast"
    /usr/bin/gmake -f CMakeFiles/cmTryCompileExec1974002327.dir/build.make CMakeFiles/cmTryCompileExec1974002327.dir/build
    gmake[1]: Entering directory `/root/lnmp/src/mysql-5.6.16/CMakeFiles/CMakeTmp'
    /usr/local/bin/cmake -E cmake_progress_report /root/lnmp/src/mysql-5.6.16/CMakeFiles/CMakeTmp/CMakeFiles 1
    Building C object CMakeFiles/cmTryCompileExec1974002327.dir/CheckFunctionExists.c.o
    /usr/bin/cc -Wall -DCHECK_FUNCTION_EXISTS=bmove -o CMakeFiles/cmTryCompileExec1974002327.dir/CheckFunctionExists.c.o -c /usr/local/share/cmake-2.8/Modules/CheckFunctionExists.c
    Linking C executable cmTryCompileExec1974002327
    /usr/local/bin/cmake -E cmake_link_script CMakeFiles/cmTryCompileExec1974002327.dir/link.txt --verbose=1
    /usr/bin/cc -Wall -DCHECK_FUNCTION_EXISTS=bmove CMakeFiles/cmTryCompileExec1974002327.dir/CheckFunctionExists.c.o -o cmTryCompileExec1974002327 -rdynamic -lm -lcrypt -ldl -lpthread -lrt
    CMakeFiles/cmTryCompileExec1974002327.dir/CheckFunctionExists.c.o: In function `main':
    CheckFunctionExists.c:(.text+0x15): undefined reference to `bmove'
    collect2: ld 返回 1
    gmake[1]: *** [cmTryCompileExec1974002327] 错误 1
    gmake[1]: Leaving directory `/root/lnmp/src/mysql-5.6.16/CMakeFiles/CMakeTmp'
    gmake: *** [cmTryCompileExec1974002327/fast] 错误 2


    Determining if the function directio exists failed with the following output:
    Change Dir: /root/lnmp/src/mysql-5.6.16/CMakeFiles/CMakeTmp

    Run Build Command:/usr/bin/gmake "cmTryCompileExec425281328/fast"
    /usr/bin/gmake -f CMakeFiles/cmTryCompileExec425281328.dir/build.make CMakeFiles/cmTryCompileExec425281328.dir/build
    gmake[1]: Entering directory `/root/lnmp/src/mysql-5.6.16/CMakeFiles/CMakeTmp'
    /usr/local/bin/cmake -E cmake_progress_report /root/lnmp/src/mysql-5.6.16/CMakeFiles/CMakeTmp/CMakeFiles 1
    Building C object CMakeFiles/cmTryCompileExec425281328.dir/CheckFunctionExists.c.o
    /usr/bin/cc -Wall -DCHECK_FUNCTION_EXISTS=directio -o CMakeFiles/cmTryCompileExec425281328.dir/CheckFunctionExists.c.o -c /usr/local/share/cmake-2.8/Modules/CheckFunctionExists.c
    Linking C executable cmTryCompileExec425281328
    /usr/local/bin/cmake -E cmake_link_script CMakeFiles/cmTryCompileExec425281328.dir/link.txt --verbose=1
    /usr/bin/cc -Wall -DCHECK_FUNCTION_EXISTS=directio CMakeFiles/cmTryCompileExec425281328.dir/CheckFunctionExists.c.o -o cmTryCompileExec425281328 -rdynamic -lm -lcrypt -ldl -lpthread -lrt
    CMakeFiles/cmTryCompileExec425281328.dir/CheckFunctionExists.c.o: In function `main':
    CheckFunctionExists.c:(.text+0x15): undefined reference to `directio'
    collect2: ld 返回 1
    gmake[1]: *** [cmTryCompileExec425281328] 错误 1
    gmake[1]: Leaving directory `/root/lnmp/src/mysql-5.6.16/CMakeFiles/CMakeTmp'
    gmake: *** [cmTryCompileExec425281328/fast] 错误 2


    Determining if the function _doprnt exists failed with the following output:
    Change Dir: /root/lnmp/src/mysql-5.6.16/CMakeFiles/CMakeTmp

    Run Build Command:/usr/bin/gmake "cmTryCompileExec1062553183/fast"
    /usr/bin/gmake -f CMakeFiles/cmTryCompileExec1062553183.dir/build.make CMakeFiles/cmTryCompileExec1062553183.dir/build
    gmake[1]: Entering directory `/root/lnmp/src/mysql-5.6.16/CMakeFiles/CMakeTmp'
    /usr/local/bin/cmake -E cmake_progress_report /root/lnmp/src/mysql-5.6.16/CMakeFiles/CMakeTmp/CMakeFiles 1
    Building C object CMakeFiles/cmTryCompileExec1062553183.dir/CheckFunctionExists.c.o
    /usr/bin/cc -Wall -DCHECK_FUNCTION_EXISTS=_doprnt -o CMakeFiles/cmTryCompileExec1062553183.dir/CheckFunctionExists.c.o -c /usr/local/share/cmake-2.8/Modules/CheckFunctionExists.c
    Linking C executable cmTryCompileExec1062553183
    /usr/local/bin/cmake -E cmake_link_script CMakeFiles/cmTryCompileExec1062553183.dir/link.txt --verbose=1
    /usr/bin/cc -Wall -DCHECK_FUNCTION_EXISTS=_doprnt CMakeFiles/cmTryCompileExec1062553183.dir/CheckFunctionExists.c.o -o cmTryCompileExec1062553183 -rdynamic -lm -lcrypt -ldl -lpthread -lrt
    CMakeFiles/cmTryCompileExec1062553183.dir/CheckFunctionExists.c.o: In function `main':
    CheckFunctionExists.c:(.text+0x15): undefined reference to `_doprnt'
    collect2: ld 返回 1
    gmake[1]: *** [cmTryCompileExec1062553183] 错误 1
    gmake[1]: Leaving directory `/root/lnmp/src/mysql-5.6.16/CMakeFiles/CMakeTmp'
    gmake: *** [cmTryCompileExec1062553183/fast] 错误 2


    Determining if the function compress exists failed with the following output:
    Change Dir: /root/lnmp/src/mysql-5.6.16/CMakeFiles/CMakeTmp

    Run Build Command:/usr/bin/gmake "cmTryCompileExec3183370708/fast"
    /usr/bin/gmake -f CMakeFiles/cmTryCompileExec3183370708.dir/build.make CMakeFiles/cmTryCompileExec3183370708.dir/build
    gmake[1]: Entering directory `/root/lnmp/src/mysql-5.6.16/CMakeFiles/CMakeTmp'
    /usr/local/bin/cmake -E cmake_progress_report /root/lnmp/src/mysql-5.6.16/CMakeFiles/CMakeTmp/CMakeFiles 1
    Building C object CMakeFiles/cmTryCompileExec3183370708.dir/CheckFunctionExists.c.o
    /usr/bin/cc -Wall -DCHECK_FUNCTION_EXISTS=compress -o CMakeFiles/cmTryCompileExec3183370708.dir/CheckFunctionExists.c.o -c /usr/local/share/cmake-2.8/Modules/CheckFunctionExists.c
    Linking C executable cmTryCompileExec3183370708
    /usr/local/bin/cmake -E cmake_link_script CMakeFiles/cmTryCompileExec3183370708.dir/link.txt --verbose=1
    /usr/bin/cc -Wall -DCHECK_FUNCTION_EXISTS=compress CMakeFiles/cmTryCompileExec3183370708.dir/CheckFunctionExists.c.o -o cmTryCompileExec3183370708 -rdynamic -lm -lcrypt -ldl -lpthread -lrt
    CMakeFiles/cmTryCompileExec3183370708.dir/CheckFunctionExists.c.o: In function `main':
    CheckFunctionExists.c:(.text+0x15): undefined reference to `compress'
    collect2: ld 返回 1
    gmake[1]: *** [cmTryCompileExec3183370708] 错误 1
    gmake[1]: Leaving directory `/root/lnmp/src/mysql-5.6.16/CMakeFiles/CMakeTmp'
    gmake: *** [cmTryCompileExec3183370708/fast] 错误 2


    Determining if the function fconvert exists failed with the following output:
    Change Dir: /root/lnmp/src/mysql-5.6.16/CMakeFiles/CMakeTmp

    Run Build Command:/usr/bin/gmake "cmTryCompileExec2150761694/fast"
    /usr/bin/gmake -f CMakeFiles/cmTryCompileExec2150761694.dir/build.make CMakeFiles/cmTryCompileExec2150761694.dir/build
    gmake[1]: Entering directory `/root/lnmp/src/mysql-5.6.16/CMakeFiles/CMakeTmp'
    /usr/local/bin/cmake -E cmake_progress_report /root/lnmp/src/mysql-5.6.16/CMakeFiles/CMakeTmp/CMakeFiles 1
    Building C object CMakeFiles/cmTryCompileExec2150761694.dir/CheckFunctionExists.c.o
    /usr/bin/cc -Wall -DCHECK_FUNCTION_EXISTS=fconvert -o CMakeFiles/cmTryCompileExec2150761694.dir/CheckFunctionExists.c.o -c /usr/local/share/cmake-2.8/Modules/CheckFunctionExists.c
    Linking C executable cmTryCompileExec2150761694
    /usr/local/bin/cmake -E cmake_link_script CMakeFiles/cmTryCompileExec2150761694.dir/link.txt --verbose=1
    /usr/bin/cc -Wall -DCHECK_FUNCTION_EXISTS=fconvert CMakeFiles/cmTryCompileExec2150761694.dir/CheckFunctionExists.c.o -o cmTryCompileExec2150761694 -rdynamic -lm -lcrypt -ldl -lpthread -lrt
    CMakeFiles/cmTryCompileExec2150761694.dir/CheckFunctionExists.c.o: In function `main':
    CheckFunctionExists.c:(.text+0x15): undefined reference to `fconvert'
    collect2: ld 返回 1
    gmake[1]: *** [cmTryCompileExec2150761694] 错误 1
    gmake[1]: Leaving directory `/root/lnmp/src/mysql-5.6.16/CMakeFiles/CMakeTmp'
    gmake: *** [cmTryCompileExec2150761694/fast] 错误 2


    Determining if the function fpsetmask exists failed with the following output:
    Change Dir: /root/lnmp/src/mysql-5.6.16/CMakeFiles/CMakeTmp

    Run Build Command:/usr/bin/gmake "cmTryCompileExec1174021924/fast"
    /usr/bin/gmake -f CMakeFiles/cmTryCompileExec1174021924.dir/build.make CMakeFiles/cmTryCompileExec1174021924.dir/build
    gmake[1]: Entering directory `/root/lnmp/src/mysql-5.6.16/CMakeFiles/CMakeTmp'
    /usr/local/bin/cmake -E cmake_progress_report /root/lnmp/src/mysql-5.6.16/CMakeFiles/CMakeTmp/CMakeFiles 1
    Building C object CMakeFiles/cmTryCompileExec1174021924.dir/CheckFunctionExists.c.o
    /usr/bin/cc -Wall -DCHECK_FUNCTION_EXISTS=fpsetmask -o CMakeFiles/cmTryCompileExec1174021924.dir/CheckFunctionExists.c.o -c /usr/local/share/cmake-2.8/Modules/CheckFunctionExists.c
    Linking C executable cmTryCompileExec1174021924
    /usr/local/bin/cmake -E cmake_link_script CMakeFiles/cmTryCompileExec1174021924.dir/link.txt --verbose=1
    /usr/bin/cc -Wall -DCHECK_FUNCTION_EXISTS=fpsetmask CMakeFiles/cmTryCompileExec1174021924.dir/CheckFunctionExists.c.o -o cmTryCompileExec1174021924 -rdynamic -lm -lcrypt -ldl -lpthread -lrt
    CMakeFiles/cmTryCompileExec1174021924.dir/CheckFunctionExists.c.o: In function `main':
    CheckFunctionExists.c:(.text+0x15): undefined reference to `fpsetmask'
    collect2: ld 返回 1
    gmake[1]: *** [cmTryCompileExec1174021924] 错误 1
    gmake[1]: Leaving directory `/root/lnmp/src/mysql-5.6.16/CMakeFiles/CMakeTmp'
    gmake: *** [cmTryCompileExec1174021924/fast] 错误 2


    Determining if the function gethrtime exists failed with the following output:
    Change Dir: /root/lnmp/src/mysql-5.6.16/CMakeFiles/CMakeTmp

    Run Build Command:/usr/bin/gmake "cmTryCompileExec1034254240/fast"
    /usr/bin/gmake -f CMakeFiles/cmTryCompileExec1034254240.dir/build.make CMakeFiles/cmTryCompileExec1034254240.dir/build
    gmake[1]: Entering directory `/root/lnmp/src/mysql-5.6.16/CMakeFiles/CMakeTmp'
    /usr/local/bin/cmake -E cmake_progress_report /root/lnmp/src/mysql-5.6.16/CMakeFiles/CMakeTmp/CMakeFiles 1
    Building C object CMakeFiles/cmTryCompileExec1034254240.dir/CheckFunctionExists.c.o
    /usr/bin/cc -Wall -DCHECK_FUNCTION_EXISTS=gethrtime -o CMakeFiles/cmTryCompileExec1034254240.dir/CheckFunctionExists.c.o -c /usr/local/share/cmake-2.8/Modules/CheckFunctionExists.c
    Linking C executable cmTryCompileExec1034254240
    /usr/local/bin/cmake -E cmake_link_script CMakeFiles/cmTryCompileExec1034254240.dir/link.txt --verbose=1
    /usr/bin/cc -Wall -DCHECK_FUNCTION_EXISTS=gethrtime CMakeFiles/cmTryCompileExec1034254240.dir/CheckFunctionExists.c.o -o cmTryCompileExec1034254240 -rdynamic -lm -lcrypt -ldl -lpthread -lrt
    CMakeFiles/cmTryCompileExec1034254240.dir/CheckFunctionExists.c.o: In function `main':
    CheckFunctionExists.c:(.text+0x15): undefined reference to `gethrtime'
    collect2: ld 返回 1
    gmake[1]: *** [cmTryCompileExec1034254240] 错误 1
    gmake[1]: Leaving directory `/root/lnmp/src/mysql-5.6.16/CMakeFiles/CMakeTmp'
    gmake: *** [cmTryCompileExec1034254240/fast] 错误 2


    Determining if the function getpassphrase exists failed with the following output:
    Change Dir: /root/lnmp/src/mysql-5.6.16/CMakeFiles/CMakeTmp

    Run Build Command:/usr/bin/gmake "cmTryCompileExec2264907155/fast"
    /usr/bin/gmake -f CMakeFiles/cmTryCompileExec2264907155.dir/build.make CMakeFiles/cmTryCompileExec2264907155.dir/build
    gmake[1]: Entering directory `/root/lnmp/src/mysql-5.6.16/CMakeFiles/CMakeTmp'
    /usr/local/bin/cmake -E cmake_progress_report /root/lnmp/src/mysql-5.6.16/CMakeFiles/CMakeTmp/CMakeFiles 1
    Building C object CMakeFiles/cmTryCompileExec2264907155.dir/CheckFunctionExists.c.o
    /usr/bin/cc -Wall -DCHECK_FUNCTION_EXISTS=getpassphrase -o CMakeFiles/cmTryCompileExec2264907155.dir/CheckFunctionExists.c.o -c /usr/local/share/cmake-2.8/Modules/CheckFunctionExists.c
    Linking C executable cmTryCompileExec2264907155
    /usr/local/bin/cmake -E cmake_link_script CMakeFiles/cmTryCompileExec2264907155.dir/link.txt --verbose=1
    /usr/bin/cc -Wall -DCHECK_FUNCTION_EXISTS=getpassphrase CMakeFiles/cmTryCompileExec2264907155.dir/CheckFunctionExists.c.o -o cmTryCompileExec2264907155 -rdynamic -lm -lcrypt -ldl -lpthread -lrt
    CMakeFiles/cmTryCompileExec2264907155.dir/CheckFunctionExists.c.o: In function `main':
    CheckFunctionExists.c:(.text+0x15): undefined reference to `getpassphrase'
    collect2: ld 返回 1
    gmake[1]: *** [cmTryCompileExec2264907155] 错误 1
    gmake[1]: Leaving directory `/root/lnmp/src/mysql-5.6.16/CMakeFiles/CMakeTmp'
    gmake: *** [cmTryCompileExec2264907155/fast] 错误 2


    Determining if the function issetugid exists failed with the following output:
    Change Dir: /root/lnmp/src/mysql-5.6.16/CMakeFiles/CMakeTmp

    Run Build Command:/usr/bin/gmake "cmTryCompileExec1939290350/fast"
    /usr/bin/gmake -f CMakeFiles/cmTryCompileExec1939290350.dir/build.make CMakeFiles/cmTryCompileExec1939290350.dir/build
    gmake[1]: Entering directory `/root/lnmp/src/mysql-5.6.16/CMakeFiles/CMakeTmp'
    /usr/local/bin/cmake -E cmake_progress_report /root/lnmp/src/mysql-5.6.16/CMakeFiles/CMakeTmp/CMakeFiles 1
    Building C object CMakeFiles/cmTryCompileExec1939290350.dir/CheckFunctionExists.c.o
    /usr/bin/cc -Wall -DCHECK_FUNCTION_EXISTS=issetugid -o CMakeFiles/cmTryCompileExec1939290350.dir/CheckFunctionExists.c.o -c /usr/local/share/cmake-2.8/Modules/CheckFunctionExists.c
    Linking C executable cmTryCompileExec1939290350
    /usr/local/bin/cmake -E cmake_link_script CMakeFiles/cmTryCompileExec1939290350.dir/link.txt --verbose=1
    /usr/bin/cc -Wall -DCHECK_FUNCTION_EXISTS=issetugid CMakeFiles/cmTryCompileExec1939290350.dir/CheckFunctionExists.c.o -o cmTryCompileExec1939290350 -rdynamic -lm -lcrypt -ldl -lpthread -lrt
    CMakeFiles/cmTryCompileExec1939290350.dir/CheckFunctionExists.c.o: In function `main':
    CheckFunctionExists.c:(.text+0x15): undefined reference to `issetugid'
    collect2: ld 返回 1
    gmake[1]: *** [cmTryCompileExec1939290350] 错误 1
    gmake[1]: Leaving directory `/root/lnmp/src/mysql-5.6.16/CMakeFiles/CMakeTmp'
    gmake: *** [cmTryCompileExec1939290350/fast] 错误 2


    Determining if the function port_create exists failed with the following output:
    Change Dir: /root/lnmp/src/mysql-5.6.16/CMakeFiles/CMakeTmp

    Run Build Command:/usr/bin/gmake "cmTryCompileExec2727823032/fast"
    /usr/bin/gmake -f CMakeFiles/cmTryCompileExec2727823032.dir/build.make CMakeFiles/cmTryCompileExec2727823032.dir/build
    gmake[1]: Entering directory `/root/lnmp/src/mysql-5.6.16/CMakeFiles/CMakeTmp'
    /usr/local/bin/cmake -E cmake_progress_report /root/lnmp/src/mysql-5.6.16/CMakeFiles/CMakeTmp/CMakeFiles 1
    Building C object CMakeFiles/cmTryCompileExec2727823032.dir/CheckFunctionExists.c.o
    /usr/bin/cc -Wall -DCHECK_FUNCTION_EXISTS=port_create -o CMakeFiles/cmTryCompileExec2727823032.dir/CheckFunctionExists.c.o -c /usr/local/share/cmake-2.8/Modules/CheckFunctionExists.c
    Linking C executable cmTryCompileExec2727823032
    /usr/local/bin/cmake -E cmake_link_script CMakeFiles/cmTryCompileExec2727823032.dir/link.txt --verbose=1
    /usr/bin/cc -Wall -DCHECK_FUNCTION_EXISTS=port_create CMakeFiles/cmTryCompileExec2727823032.dir/CheckFunctionExists.c.o -o cmTryCompileExec2727823032 -rdynamic -lm -lcrypt -ldl -lpthread -lrt
    CMakeFiles/cmTryCompileExec2727823032.dir/CheckFunctionExists.c.o: In function `main':
    CheckFunctionExists.c:(.text+0x15): undefined reference to `port_create'
    collect2: ld 返回 1
    gmake[1]: *** [cmTryCompileExec2727823032] 错误 1
    gmake[1]: Leaving directory `/root/lnmp/src/mysql-5.6.16/CMakeFiles/CMakeTmp'
    gmake: *** [cmTryCompileExec2727823032/fast] 错误 2


    Determining if the function pthread_attr_create exists failed with the following output:
    Change Dir: /root/lnmp/src/mysql-5.6.16/CMakeFiles/CMakeTmp

    Run Build Command:/usr/bin/gmake "cmTryCompileExec2867332448/fast"
    /usr/bin/gmake -f CMakeFiles/cmTryCompileExec2867332448.dir/build.make CMakeFiles/cmTryCompileExec2867332448.dir/build
    gmake[1]: Entering directory `/root/lnmp/src/mysql-5.6.16/CMakeFiles/CMakeTmp'
    /usr/local/bin/cmake -E cmake_progress_report /root/lnmp/src/mysql-5.6.16/CMakeFiles/CMakeTmp/CMakeFiles 1
    Building C object CMakeFiles/cmTryCompileExec2867332448.dir/CheckFunctionExists.c.o
    /usr/bin/cc -Wall -DCHECK_FUNCTION_EXISTS=pthread_attr_create -o CMakeFiles/cmTryCompileExec2867332448.dir/CheckFunctionExists.c.o -c /usr/local/share/cmake-2.8/Modules/CheckFunctionExists.c
    Linking C executable cmTryCompileExec2867332448
    /usr/local/bin/cmake -E cmake_link_script CMakeFiles/cmTryCompileExec2867332448.dir/link.txt --verbose=1
    /usr/bin/cc -Wall -DCHECK_FUNCTION_EXISTS=pthread_attr_create CMakeFiles/cmTryCompileExec2867332448.dir/CheckFunctionExists.c.o -o cmTryCompileExec2867332448 -rdynamic -lm -lcrypt -ldl -lpthread -lrt
    CMakeFiles/cmTryCompileExec2867332448.dir/CheckFunctionExists.c.o: In function `main':
    CheckFunctionExists.c:(.text+0x15): undefined reference to `pthread_attr_create'
    collect2: ld 返回 1
    gmake[1]: *** [cmTryCompileExec2867332448] 错误 1
    gmake[1]: Leaving directory `/root/lnmp/src/mysql-5.6.16/CMakeFiles/CMakeTmp'
    gmake: *** [cmTryCompileExec2867332448/fast] 错误 2


    Determining if the function pthread_condattr_create exists failed with the following output:
    Change Dir: /root/lnmp/src/mysql-5.6.16/CMakeFiles/CMakeTmp

    Run Build Command:/usr/bin/gmake "cmTryCompileExec3614935893/fast"
    /usr/bin/gmake -f CMakeFiles/cmTryCompileExec3614935893.dir/build.make CMakeFiles/cmTryCompileExec3614935893.dir/build
    gmake[1]: Entering directory `/root/lnmp/src/mysql-5.6.16/CMakeFiles/CMakeTmp'
    /usr/local/bin/cmake -E cmake_progress_report /root/lnmp/src/mysql-5.6.16/CMakeFiles/CMakeTmp/CMakeFiles 1
    Building C object CMakeFiles/cmTryCompileExec3614935893.dir/CheckFunctionExists.c.o
    /usr/bin/cc -Wall -DCHECK_FUNCTION_EXISTS=pthread_condattr_create -o CMakeFiles/cmTryCompileExec3614935893.dir/CheckFunctionExists.c.o -c /usr/local/share/cmake-2.8/Modules/CheckFunctionExists.c
    Linking C executable cmTryCompileExec3614935893
    /usr/local/bin/cmake -E cmake_link_script CMakeFiles/cmTryCompileExec3614935893.dir/link.txt --verbose=1
    /usr/bin/cc -Wall -DCHECK_FUNCTION_EXISTS=pthread_condattr_create CMakeFiles/cmTryCompileExec3614935893.dir/CheckFunctionExists.c.o -o cmTryCompileExec3614935893 -rdynamic -lm -lcrypt -ldl -lpthread -lrt
    CMakeFiles/cmTryCompileExec3614935893.dir/CheckFunctionExists.c.o: In function `main':
    CheckFunctionExists.c:(.text+0x15): undefined reference to `pthread_condattr_create'
    collect2: ld 返回 1
    gmake[1]: *** [cmTryCompileExec3614935893] 错误 1
    gmake[1]: Leaving directory `/root/lnmp/src/mysql-5.6.16/CMakeFiles/CMakeTmp'
    gmake: *** [cmTryCompileExec3614935893/fast] 错误 2


    Determining if the function pthread_threadmask exists failed with the following output:
    Change Dir: /root/lnmp/src/mysql-5.6.16/CMakeFiles/CMakeTmp

    Run Build Command:/usr/bin/gmake "cmTryCompileExec2377289542/fast"
    /usr/bin/gmake -f CMakeFiles/cmTryCompileExec2377289542.dir/build.make CMakeFiles/cmTryCompileExec2377289542.dir/build
    gmake[1]: Entering directory `/root/lnmp/src/mysql-5.6.16/CMakeFiles/CMakeTmp'
    /usr/local/bin/cmake -E cmake_progress_report /root/lnmp/src/mysql-5.6.16/CMakeFiles/CMakeTmp/CMakeFiles 1
    Building C object CMakeFiles/cmTryCompileExec2377289542.dir/CheckFunctionExists.c.o
    /usr/bin/cc -Wall -DCHECK_FUNCTION_EXISTS=pthread_threadmask -o CMakeFiles/cmTryCompileExec2377289542.dir/CheckFunctionExists.c.o -c /usr/local/share/cmake-2.8/Modules/CheckFunctionExists.c
    Linking C executable cmTryCompileExec2377289542
    /usr/local/bin/cmake -E cmake_link_script CMakeFiles/cmTryCompileExec2377289542.dir/link.txt --verbose=1
    /usr/bin/cc -Wall -DCHECK_FUNCTION_EXISTS=pthread_threadmask CMakeFiles/cmTryCompileExec2377289542.dir/CheckFunctionExists.c.o -o cmTryCompileExec2377289542 -rdynamic -lm -lcrypt -ldl -lpthread -lrt
    CMakeFiles/cmTryCompileExec2377289542.dir/CheckFunctionExists.c.o: In function `main':
    CheckFunctionExists.c:(.text+0x15): undefined reference to `pthread_threadmask'
    collect2: ld 返回 1
    gmake[1]: *** [cmTryCompileExec2377289542] 错误 1
    gmake[1]: Leaving directory `/root/lnmp/src/mysql-5.6.16/CMakeFiles/CMakeTmp'
    gmake: *** [cmTryCompileExec2377289542/fast] 错误 2


    Determining if the function pthread_yield_np exists failed with the following output:
    Change Dir: /root/lnmp/src/mysql-5.6.16/CMakeFiles/CMakeTmp

    Run Build Command:/usr/bin/gmake "cmTryCompileExec1124666734/fast"
    /usr/bin/gmake -f CMakeFiles/cmTryCompileExec1124666734.dir/build.make CMakeFiles/cmTryCompileExec1124666734.dir/build
    gmake[1]: Entering directory `/root/lnmp/src/mysql-5.6.16/CMakeFiles/CMakeTmp'
    /usr/local/bin/cmake -E cmake_progress_report /root/lnmp/src/mysql-5.6.16/CMakeFiles/CMakeTmp/CMakeFiles 1
    Building C object CMakeFiles/cmTryCompileExec1124666734.dir/CheckFunctionExists.c.o
    /usr/bin/cc -Wall -DCHECK_FUNCTION_EXISTS=pthread_yield_np -o CMakeFiles/cmTryCompileExec1124666734.dir/CheckFunctionExists.c.o -c /usr/local/share/cmake-2.8/Modules/CheckFunctionExists.c
    Linking C executable cmTryCompileExec1124666734
    /usr/local/bin/cmake -E cmake_link_script CMakeFiles/cmTryCompileExec1124666734.dir/link.txt --verbose=1
    /usr/bin/cc -Wall -DCHECK_FUNCTION_EXISTS=pthread_yield_np CMakeFiles/cmTryCompileExec1124666734.dir/CheckFunctionExists.c.o -o cmTryCompileExec1124666734 -rdynamic -lm -lcrypt -ldl -lpthread -lrt
    CMakeFiles/cmTryCompileExec1124666734.dir/CheckFunctionExists.c.o: In function `main':
    CheckFunctionExists.c:(.text+0x15): undefined reference to `pthread_yield_np'
    collect2: ld 返回 1
    gmake[1]: *** [cmTryCompileExec1124666734] 错误 1
    gmake[1]: Leaving directory `/root/lnmp/src/mysql-5.6.16/CMakeFiles/CMakeTmp'
    gmake: *** [cmTryCompileExec1124666734/fast] 错误 2


    Determining if the function rwlock_init exists failed with the following output:
    Change Dir: /root/lnmp/src/mysql-5.6.16/CMakeFiles/CMakeTmp

    Run Build Command:/usr/bin/gmake "cmTryCompileExec3598021653/fast"
    /usr/bin/gmake -f CMakeFiles/cmTryCompileExec3598021653.dir/build.make CMakeFiles/cmTryCompileExec3598021653.dir/build
    gmake[1]: Entering directory `/root/lnmp/src/mysql-5.6.16/CMakeFiles/CMakeTmp'
    /usr/local/bin/cmake -E cmake_progress_report /root/lnmp/src/mysql-5.6.16/CMakeFiles/CMakeTmp/CMakeFiles 1
    Building C object CMakeFiles/cmTryCompileExec3598021653.dir/CheckFunctionExists.c.o
    /usr/bin/cc -Wall -DCHECK_FUNCTION_EXISTS=rwlock_init -o CMakeFiles/cmTryCompileExec3598021653.dir/CheckFunctionExists.c.o -c /usr/local/share/cmake-2.8/Modules/CheckFunctionExists.c
    Linking C executable cmTryCompileExec3598021653
    /usr/local/bin/cmake -E cmake_link_script CMakeFiles/cmTryCompileExec3598021653.dir/link.txt --verbose=1
    /usr/bin/cc -Wall -DCHECK_FUNCTION_EXISTS=rwlock_init CMakeFiles/cmTryCompileExec3598021653.dir/CheckFunctionExists.c.o -o cmTryCompileExec3598021653 -rdynamic -lm -lcrypt -ldl -lpthread -lrt
    CMakeFiles/cmTryCompileExec3598021653.dir/CheckFunctionExists.c.o: In function `main':
    CheckFunctionExists.c:(.text+0x15): undefined reference to `rwlock_init'
    collect2: ld 返回 1
    gmake[1]: *** [cmTryCompileExec3598021653] 错误 1
    gmake[1]: Leaving directory `/root/lnmp/src/mysql-5.6.16/CMakeFiles/CMakeTmp'
    gmake: *** [cmTryCompileExec3598021653/fast] 错误 2


    Determining if the function setfd exists failed with the following output:
    Change Dir: /root/lnmp/src/mysql-5.6.16/CMakeFiles/CMakeTmp

    Run Build Command:/usr/bin/gmake "cmTryCompileExec2252785435/fast"
    /usr/bin/gmake -f CMakeFiles/cmTryCompileExec2252785435.dir/build.make CMakeFiles/cmTryCompileExec2252785435.dir/build
    gmake[1]: Entering directory `/root/lnmp/src/mysql-5.6.16/CMakeFiles/CMakeTmp'
    /usr/local/bin/cmake -E cmake_progress_report /root/lnmp/src/mysql-5.6.16/CMakeFiles/CMakeTmp/CMakeFiles 1
    Building C object CMakeFiles/cmTryCompileExec2252785435.dir/CheckFunctionExists.c.o
    /usr/bin/cc -Wall -DCHECK_FUNCTION_EXISTS=setfd -o CMakeFiles/cmTryCompileExec2252785435.dir/CheckFunctionExists.c.o -c /usr/local/share/cmake-2.8/Modules/CheckFunctionExists.c
    Linking C executable cmTryCompileExec2252785435
    /usr/local/bin/cmake -E cmake_link_script CMakeFiles/cmTryCompileExec2252785435.dir/link.txt --verbose=1
    /usr/bin/cc -Wall -DCHECK_FUNCTION_EXISTS=setfd CMakeFiles/cmTryCompileExec2252785435.dir/CheckFunctionExists.c.o -o cmTryCompileExec2252785435 -rdynamic -lm -lcrypt -ldl -lpthread -lrt
    CMakeFiles/cmTryCompileExec2252785435.dir/CheckFunctionExists.c.o: In function `main':
    CheckFunctionExists.c:(.text+0x15): undefined reference to `setfd'
    collect2: ld 返回 1
    gmake[1]: *** [cmTryCompileExec2252785435] 错误 1
    gmake[1]: Leaving directory `/root/lnmp/src/mysql-5.6.16/CMakeFiles/CMakeTmp'
    gmake: *** [cmTryCompileExec2252785435/fast] 错误 2


    Determining if the function sigthreadmask exists failed with the following output:
    Change Dir: /root/lnmp/src/mysql-5.6.16/CMakeFiles/CMakeTmp

    Run Build Command:/usr/bin/gmake "cmTryCompileExec2578533818/fast"
    /usr/bin/gmake -f CMakeFiles/cmTryCompileExec2578533818.dir/build.make CMakeFiles/cmTryCompileExec2578533818.dir/build
    gmake[1]: Entering directory `/root/lnmp/src/mysql-5.6.16/CMakeFiles/CMakeTmp'
    /usr/local/bin/cmake -E cmake_progress_report /root/lnmp/src/mysql-5.6.16/CMakeFiles/CMakeTmp/CMakeFiles 1
    Building C object CMakeFiles/cmTryCompileExec2578533818.dir/CheckFunctionExists.c.o
    /usr/bin/cc -Wall -DCHECK_FUNCTION_EXISTS=sigthreadmask -o CMakeFiles/cmTryCompileExec2578533818.dir/CheckFunctionExists.c.o -c /usr/local/share/cmake-2.8/Modules/CheckFunctionExists.c
    Linking C executable cmTryCompileExec2578533818
    /usr/local/bin/cmake -E cmake_link_script CMakeFiles/cmTryCompileExec2578533818.dir/link.txt --verbose=1
    /usr/bin/cc -Wall -DCHECK_FUNCTION_EXISTS=sigthreadmask CMakeFiles/cmTryCompileExec2578533818.dir/CheckFunctionExists.c.o -o cmTryCompileExec2578533818 -rdynamic -lm -lcrypt -ldl -lpthread -lrt
    CMakeFiles/cmTryCompileExec2578533818.dir/CheckFunctionExists.c.o: In function `main':
    CheckFunctionExists.c:(.text+0x15): undefined reference to `sigthreadmask'
    collect2: ld 返回 1
    gmake[1]: *** [cmTryCompileExec2578533818] 错误 1
    gmake[1]: Leaving directory `/root/lnmp/src/mysql-5.6.16/CMakeFiles/CMakeTmp'
    gmake: *** [cmTryCompileExec2578533818/fast] 错误 2


    Determining if the function strlcpy exists failed with the following output:
    Change Dir: /root/lnmp/src/mysql-5.6.16/CMakeFiles/CMakeTmp

    Run Build Command:/usr/bin/gmake "cmTryCompileExec4105530058/fast"
    /usr/bin/gmake -f CMakeFiles/cmTryCompileExec4105530058.dir/build.make CMakeFiles/cmTryCompileExec4105530058.dir/build
    gmake[1]: Entering directory `/root/lnmp/src/mysql-5.6.16/CMakeFiles/CMakeTmp'
    /usr/local/bin/cmake -E cmake_progress_report /root/lnmp/src/mysql-5.6.16/CMakeFiles/CMakeTmp/CMakeFiles 1
    Building C object CMakeFiles/cmTryCompileExec4105530058.dir/CheckFunctionExists.c.o
    /usr/bin/cc -Wall -DCHECK_FUNCTION_EXISTS=strlcpy -o CMakeFiles/cmTryCompileExec4105530058.dir/CheckFunctionExists.c.o -c /usr/local/share/cmake-2.8/Modules/CheckFunctionExists.c
    Linking C executable cmTryCompileExec4105530058
    /usr/local/bin/cmake -E cmake_link_script CMakeFiles/cmTryCompileExec4105530058.dir/link.txt --verbose=1
    /usr/bin/cc -Wall -DCHECK_FUNCTION_EXISTS=strlcpy CMakeFiles/cmTryCompileExec4105530058.dir/CheckFunctionExists.c.o -o cmTryCompileExec4105530058 -rdynamic -lm -lcrypt -ldl -lpthread -lrt
    CMakeFiles/cmTryCompileExec4105530058.dir/CheckFunctionExists.c.o: In function `main':
    CheckFunctionExists.c:(.text+0x15): undefined reference to `strlcpy'
    collect2: ld 返回 1
    gmake[1]: Leaving directory `/root/lnmp/src/mysql-5.6.16/CMakeFiles/CMakeTmp'
    gmake[1]: *** [cmTryCompileExec4105530058] 错误 1
    gmake: *** [cmTryCompileExec4105530058/fast] 错误 2


    Determining if the function strlcat exists failed with the following output:
    Change Dir: /root/lnmp/src/mysql-5.6.16/CMakeFiles/CMakeTmp

    Run Build Command:/usr/bin/gmake "cmTryCompileExec4106081448/fast"
    /usr/bin/gmake -f CMakeFiles/cmTryCompileExec4106081448.dir/build.make CMakeFiles/cmTryCompileExec4106081448.dir/build
    gmake[1]: Entering directory `/root/lnmp/src/mysql-5.6.16/CMakeFiles/CMakeTmp'
    /usr/local/bin/cmake -E cmake_progress_report /root/lnmp/src/mysql-5.6.16/CMakeFiles/CMakeTmp/CMakeFiles 1
    Building C object CMakeFiles/cmTryCompileExec4106081448.dir/CheckFunctionExists.c.o
    /usr/bin/cc -Wall -DCHECK_FUNCTION_EXISTS=strlcat -o CMakeFiles/cmTryCompileExec4106081448.dir/CheckFunctionExists.c.o -c /usr/local/share/cmake-2.8/Modules/CheckFunctionExists.c
    Linking C executable cmTryCompileExec4106081448
    /usr/local/bin/cmake -E cmake_link_script CMakeFiles/cmTryCompileExec4106081448.dir/link.txt --verbose=1
    /usr/bin/cc -Wall -DCHECK_FUNCTION_EXISTS=strlcat CMakeFiles/cmTryCompileExec4106081448.dir/CheckFunctionExists.c.o -o cmTryCompileExec4106081448 -rdynamic -lm -lcrypt -ldl -lpthread -lrt
    CMakeFiles/cmTryCompileExec4106081448.dir/CheckFunctionExists.c.o: In function `main':
    CheckFunctionExists.c:(.text+0x15): undefined reference to `strlcat'
    collect2: ld 返回 1
    gmake[1]: *** [cmTryCompileExec4106081448] 错误 1
    gmake[1]: Leaving directory `/root/lnmp/src/mysql-5.6.16/CMakeFiles/CMakeTmp'
    gmake: *** [cmTryCompileExec4106081448/fast] 错误 2


    Determining if the function fgetln exists failed with the following output:
    Change Dir: /root/lnmp/src/mysql-5.6.16/CMakeFiles/CMakeTmp

    Run Build Command:/usr/bin/gmake "cmTryCompileExec1475655354/fast"
    /usr/bin/gmake -f CMakeFiles/cmTryCompileExec1475655354.dir/build.make CMakeFiles/cmTryCompileExec1475655354.dir/build
    gmake[1]: Entering directory `/root/lnmp/src/mysql-5.6.16/CMakeFiles/CMakeTmp'
    /usr/local/bin/cmake -E cmake_progress_report /root/lnmp/src/mysql-5.6.16/CMakeFiles/CMakeTmp/CMakeFiles 1
    Building C object CMakeFiles/cmTryCompileExec1475655354.dir/CheckFunctionExists.c.o
    /usr/bin/cc -Wall -DCHECK_FUNCTION_EXISTS=fgetln -o CMakeFiles/cmTryCompileExec1475655354.dir/CheckFunctionExists.c.o -c /usr/local/share/cmake-2.8/Modules/CheckFunctionExists.c
    Linking C executable cmTryCompileExec1475655354
    /usr/local/bin/cmake -E cmake_link_script CMakeFiles/cmTryCompileExec1475655354.dir/link.txt --verbose=1
    /usr/bin/cc -Wall -DCHECK_FUNCTION_EXISTS=fgetln CMakeFiles/cmTryCompileExec1475655354.dir/CheckFunctionExists.c.o -o cmTryCompileExec1475655354 -rdynamic -lm -lcrypt -ldl -lpthread -lrt
    CMakeFiles/cmTryCompileExec1475655354.dir/CheckFunctionExists.c.o: In function `main':
    CheckFunctionExists.c:(.text+0x15): undefined reference to `fgetln'
    collect2: ld 返回 1
    gmake[1]: *** [cmTryCompileExec1475655354] 错误 1
    gmake[1]: Leaving directory `/root/lnmp/src/mysql-5.6.16/CMakeFiles/CMakeTmp'
    gmake: *** [cmTryCompileExec1475655354/fast] 错误 2


    Determining if the function tell exists failed with the following output:
    Change Dir: /root/lnmp/src/mysql-5.6.16/CMakeFiles/CMakeTmp

    Run Build Command:/usr/bin/gmake "cmTryCompileExec2480252644/fast"
    /usr/bin/gmake -f CMakeFiles/cmTryCompileExec2480252644.dir/build.make CMakeFiles/cmTryCompileExec2480252644.dir/build
    gmake[1]: Entering directory `/root/lnmp/src/mysql-5.6.16/CMakeFiles/CMakeTmp'
    /usr/local/bin/cmake -E cmake_progress_report /root/lnmp/src/mysql-5.6.16/CMakeFiles/CMakeTmp/CMakeFiles 1
    Building C object CMakeFiles/cmTryCompileExec2480252644.dir/CheckFunctionExists.c.o
    /usr/bin/cc -Wall -DCHECK_FUNCTION_EXISTS=tell -o CMakeFiles/cmTryCompileExec2480252644.dir/CheckFunctionExists.c.o -c /usr/local/share/cmake-2.8/Modules/CheckFunctionExists.c
    Linking C executable cmTryCompileExec2480252644
    /usr/local/bin/cmake -E cmake_link_script CMakeFiles/cmTryCompileExec2480252644.dir/link.txt --verbose=1
    /usr/bin/cc -Wall -DCHECK_FUNCTION_EXISTS=tell CMakeFiles/cmTryCompileExec2480252644.dir/CheckFunctionExists.c.o -o cmTryCompileExec2480252644 -rdynamic -lm -lcrypt -ldl -lpthread -lrt
    CMakeFiles/cmTryCompileExec2480252644.dir/CheckFunctionExists.c.o: In function `main':
    CheckFunctionExists.c:(.text+0x15): undefined reference to `tell'
    collect2: ld 返回 1
    gmake[1]: *** [cmTryCompileExec2480252644] 错误 1
    gmake[1]: Leaving directory `/root/lnmp/src/mysql-5.6.16/CMakeFiles/CMakeTmp'
    gmake: *** [cmTryCompileExec2480252644/fast] 错误 2


    Determining if the function thr_setconcurrency exists failed with the following output:
    Change Dir: /root/lnmp/src/mysql-5.6.16/CMakeFiles/CMakeTmp

    Run Build Command:/usr/bin/gmake "cmTryCompileExec610512686/fast"
    /usr/bin/gmake -f CMakeFiles/cmTryCompileExec610512686.dir/build.make CMakeFiles/cmTryCompileExec610512686.dir/build
    gmake[1]: Entering directory `/root/lnmp/src/mysql-5.6.16/CMakeFiles/CMakeTmp'
    /usr/local/bin/cmake -E cmake_progress_report /root/lnmp/src/mysql-5.6.16/CMakeFiles/CMakeTmp/CMakeFiles 1
    Building C object CMakeFiles/cmTryCompileExec610512686.dir/CheckFunctionExists.c.o
    /usr/bin/cc -Wall -DCHECK_FUNCTION_EXISTS=thr_setconcurrency -o CMakeFiles/cmTryCompileExec610512686.dir/CheckFunctionExists.c.o -c /usr/local/share/cmake-2.8/Modules/CheckFunctionExists.c
    Linking C executable cmTryCompileExec610512686
    /usr/local/bin/cmake -E cmake_link_script CMakeFiles/cmTryCompileExec610512686.dir/link.txt --verbose=1
    /usr/bin/cc -Wall -DCHECK_FUNCTION_EXISTS=thr_setconcurrency CMakeFiles/cmTryCompileExec610512686.dir/CheckFunctionExists.c.o -o cmTryCompileExec610512686 -rdynamic -lm -lcrypt -ldl -lpthread -lrt
    CMakeFiles/cmTryCompileExec610512686.dir/CheckFunctionExists.c.o: In function `main':
    CheckFunctionExists.c:(.text+0x15): undefined reference to `thr_setconcurrency'
    collect2: ld 返回 1
    gmake[1]: Leaving directory `/root/lnmp/src/mysql-5.6.16/CMakeFiles/CMakeTmp'
    gmake[1]: *** [cmTryCompileExec610512686] 错误 1
    gmake: *** [cmTryCompileExec610512686/fast] 错误 2


    Determining if the function thr_yield exists failed with the following output:
    Change Dir: /root/lnmp/src/mysql-5.6.16/CMakeFiles/CMakeTmp

    Run Build Command:/usr/bin/gmake "cmTryCompileExec3864505585/fast"
    /usr/bin/gmake -f CMakeFiles/cmTryCompileExec3864505585.dir/build.make CMakeFiles/cmTryCompileExec3864505585.dir/build
    gmake[1]: Entering directory `/root/lnmp/src/mysql-5.6.16/CMakeFiles/CMakeTmp'
    /usr/local/bin/cmake -E cmake_progress_report /root/lnmp/src/mysql-5.6.16/CMakeFiles/CMakeTmp/CMakeFiles 1
    Building C object CMakeFiles/cmTryCompileExec3864505585.dir/CheckFunctionExists.c.o
    /usr/bin/cc -Wall -DCHECK_FUNCTION_EXISTS=thr_yield -o CMakeFiles/cmTryCompileExec3864505585.dir/CheckFunctionExists.c.o -c /usr/local/share/cmake-2.8/Modules/CheckFunctionExists.c
    Linking C executable cmTryCompileExec3864505585
    /usr/local/bin/cmake -E cmake_link_script CMakeFiles/cmTryCompileExec3864505585.dir/link.txt --verbose=1
    /usr/bin/cc -Wall -DCHECK_FUNCTION_EXISTS=thr_yield CMakeFiles/cmTryCompileExec3864505585.dir/CheckFunctionExists.c.o -o cmTryCompileExec3864505585 -rdynamic -lm -lcrypt -ldl -lpthread -lrt
    CMakeFiles/cmTryCompileExec3864505585.dir/CheckFunctionExists.c.o: In function `main':
    CheckFunctionExists.c:(.text+0x15): undefined reference to `thr_yield'
    collect2: ld 返回 1
    gmake[1]: Leaving directory `/root/lnmp/src/mysql-5.6.16/CMakeFiles/CMakeTmp'
    gmake[1]: *** [cmTryCompileExec3864505585] 错误 1
    gmake: *** [cmTryCompileExec3864505585/fast] 错误 2


    Determining if the function ntohll exists failed with the following output:
    Change Dir: /root/lnmp/src/mysql-5.6.16/CMakeFiles/CMakeTmp

    Run Build Command:/usr/bin/gmake "cmTryCompileExec3492861695/fast"
    /usr/bin/gmake -f CMakeFiles/cmTryCompileExec3492861695.dir/build.make CMakeFiles/cmTryCompileExec3492861695.dir/build
    gmake[1]: Entering directory `/root/lnmp/src/mysql-5.6.16/CMakeFiles/CMakeTmp'
    /usr/local/bin/cmake -E cmake_progress_report /root/lnmp/src/mysql-5.6.16/CMakeFiles/CMakeTmp/CMakeFiles 1
    Building C object CMakeFiles/cmTryCompileExec3492861695.dir/CheckFunctionExists.c.o
    /usr/bin/cc -Wall -DCHECK_FUNCTION_EXISTS=ntohll -o CMakeFiles/cmTryCompileExec3492861695.dir/CheckFunctionExists.c.o -c /usr/local/share/cmake-2.8/Modules/CheckFunctionExists.c
    Linking C executable cmTryCompileExec3492861695
    /usr/local/bin/cmake -E cmake_link_script CMakeFiles/cmTryCompileExec3492861695.dir/link.txt --verbose=1
    /usr/bin/cc -Wall -DCHECK_FUNCTION_EXISTS=ntohll CMakeFiles/cmTryCompileExec3492861695.dir/CheckFunctionExists.c.o -o cmTryCompileExec3492861695 -rdynamic -lm -lcrypt -ldl -lpthread -lrt
    CMakeFiles/cmTryCompileExec3492861695.dir/CheckFunctionExists.c.o: In function `main':
    CheckFunctionExists.c:(.text+0x15): undefined reference to `ntohll'
    collect2: ld 返回 1
    gmake[1]: *** [cmTryCompileExec3492861695] 错误 1
    gmake[1]: Leaving directory `/root/lnmp/src/mysql-5.6.16/CMakeFiles/CMakeTmp'
    gmake: *** [cmTryCompileExec3492861695/fast] 错误 2


    Determining if the function kqueue exists failed with the following output:
    Change Dir: /root/lnmp/src/mysql-5.6.16/CMakeFiles/CMakeTmp

    Run Build Command:/usr/bin/gmake "cmTryCompileExec1275269078/fast"
    /usr/bin/gmake -f CMakeFiles/cmTryCompileExec1275269078.dir/build.make CMakeFiles/cmTryCompileExec1275269078.dir/build
    gmake[1]: Entering directory `/root/lnmp/src/mysql-5.6.16/CMakeFiles/CMakeTmp'
    /usr/local/bin/cmake -E cmake_progress_report /root/lnmp/src/mysql-5.6.16/CMakeFiles/CMakeTmp/CMakeFiles 1
    Building C object CMakeFiles/cmTryCompileExec1275269078.dir/CheckFunctionExists.c.o
    /usr/bin/cc -Wall -DCHECK_FUNCTION_EXISTS=kqueue -o CMakeFiles/cmTryCompileExec1275269078.dir/CheckFunctionExists.c.o -c /usr/local/share/cmake-2.8/Modules/CheckFunctionExists.c
    Linking C executable cmTryCompileExec1275269078
    /usr/local/bin/cmake -E cmake_link_script CMakeFiles/cmTryCompileExec1275269078.dir/link.txt --verbose=1
    /usr/bin/cc -Wall -DCHECK_FUNCTION_EXISTS=kqueue CMakeFiles/cmTryCompileExec1275269078.dir/CheckFunctionExists.c.o -o cmTryCompileExec1275269078 -rdynamic -lm -lcrypt -ldl -lpthread -lrt
    CMakeFiles/cmTryCompileExec1275269078.dir/CheckFunctionExists.c.o: In function `main':
    CheckFunctionExists.c:(.text+0x15): undefined reference to `kqueue'
    collect2: ld 返回 1
    gmake[1]: *** [cmTryCompileExec1275269078] 错误 1
    gmake[1]: Leaving directory `/root/lnmp/src/mysql-5.6.16/CMakeFiles/CMakeTmp'
    gmake: *** [cmTryCompileExec1275269078/fast] 错误 2


    Determining if the function kqueue exists failed with the following output:
    Change Dir: /root/lnmp/src/mysql-5.6.16/CMakeFiles/CMakeTmp

    Run Build Command:/usr/bin/gmake "cmTryCompileExec3420939301/fast"
    /usr/bin/gmake -f CMakeFiles/cmTryCompileExec3420939301.dir/build.make CMakeFiles/cmTryCompileExec3420939301.dir/build
    gmake[1]: Entering directory `/root/lnmp/src/mysql-5.6.16/CMakeFiles/CMakeTmp'
    /usr/local/bin/cmake -E cmake_progress_report /root/lnmp/src/mysql-5.6.16/CMakeFiles/CMakeTmp/CMakeFiles 1
    Building C object CMakeFiles/cmTryCompileExec3420939301.dir/CheckFunctionExists.c.o
    /usr/bin/cc -Wall -DCHECK_FUNCTION_EXISTS=kqueue -o CMakeFiles/cmTryCompileExec3420939301.dir/CheckFunctionExists.c.o -c /usr/local/share/cmake-2.8/Modules/CheckFunctionExists.c
    Linking C executable cmTryCompileExec3420939301
    /usr/local/bin/cmake -E cmake_link_script CMakeFiles/cmTryCompileExec3420939301.dir/link.txt --verbose=1
    /usr/bin/cc -Wall -DCHECK_FUNCTION_EXISTS=kqueue CMakeFiles/cmTryCompileExec3420939301.dir/CheckFunctionExists.c.o -o cmTryCompileExec3420939301 -rdynamic -lm -lcrypt -ldl -lpthread -lrt
    CMakeFiles/cmTryCompileExec3420939301.dir/CheckFunctionExists.c.o: In function `main':
    CheckFunctionExists.c:(.text+0x15): undefined reference to `kqueue'
    collect2: ld 返回 1
    gmake[1]: *** [cmTryCompileExec3420939301] 错误 1
    gmake[1]: Leaving directory `/root/lnmp/src/mysql-5.6.16/CMakeFiles/CMakeTmp'
    gmake: *** [cmTryCompileExec3420939301/fast] 错误 2


    Determining if files ia64intrin.h exist failed with the following output:
    Change Dir: /root/lnmp/src/mysql-5.6.16/CMakeFiles/CMakeTmp

    Run Build Command:/usr/bin/gmake "cmTryCompileExec2123365300/fast"
    /usr/bin/gmake -f CMakeFiles/cmTryCompileExec2123365300.dir/build.make CMakeFiles/cmTryCompileExec2123365300.dir/build
    gmake[1]: Entering directory `/root/lnmp/src/mysql-5.6.16/CMakeFiles/CMakeTmp'
    /usr/local/bin/cmake -E cmake_progress_report /root/lnmp/src/mysql-5.6.16/CMakeFiles/CMakeTmp/CMakeFiles 1
    Building C object CMakeFiles/cmTryCompileExec2123365300.dir/CheckIncludeFiles.c.o
    /usr/bin/cc -Wall -o CMakeFiles/cmTryCompileExec2123365300.dir/CheckIncludeFiles.c.o -c /root/lnmp/src/mysql-5.6.16/CMakeFiles/CMakeTmp/CheckIncludeFiles.c
    /root/lnmp/src/mysql-5.6.16/CMakeFiles/CMakeTmp/CheckIncludeFiles.c:2:24: 错误:ia64intrin.h:没有那个文件或目录
    gmake[1]: *** [CMakeFiles/cmTryCompileExec2123365300.dir/CheckIncludeFiles.c.o] 错误 1
    gmake[1]: Leaving directory `/root/lnmp/src/mysql-5.6.16/CMakeFiles/CMakeTmp'
    gmake: *** [cmTryCompileExec2123365300/fast] 错误 2

    Source:
    /* */
    #include <ia64intrin.h>


    int main(){return 0;}

    Determining if the function read_real_time exists failed with the following output:
    Change Dir: /root/lnmp/src/mysql-5.6.16/CMakeFiles/CMakeTmp

    Run Build Command:/usr/bin/gmake "cmTryCompileExec2662387648/fast"
    /usr/bin/gmake -f CMakeFiles/cmTryCompileExec2662387648.dir/build.make CMakeFiles/cmTryCompileExec2662387648.dir/build
    gmake[1]: Entering directory `/root/lnmp/src/mysql-5.6.16/CMakeFiles/CMakeTmp'
    /usr/local/bin/cmake -E cmake_progress_report /root/lnmp/src/mysql-5.6.16/CMakeFiles/CMakeTmp/CMakeFiles 1
    Building C object CMakeFiles/cmTryCompileExec2662387648.dir/CheckFunctionExists.c.o
    /usr/bin/cc -Wall -DCHECK_FUNCTION_EXISTS=read_real_time -o CMakeFiles/cmTryCompileExec2662387648.dir/CheckFunctionExists.c.o -c /usr/local/share/cmake-2.8/Modules/CheckFunctionExists.c
    Linking C executable cmTryCompileExec2662387648
    /usr/local/bin/cmake -E cmake_link_script CMakeFiles/cmTryCompileExec2662387648.dir/link.txt --verbose=1
    /usr/bin/cc -Wall -DCHECK_FUNCTION_EXISTS=read_real_time CMakeFiles/cmTryCompileExec2662387648.dir/CheckFunctionExists.c.o -o cmTryCompileExec2662387648 -rdynamic -lm -lcrypt -ldl -lpthread -lrt
    CMakeFiles/cmTryCompileExec2662387648.dir/CheckFunctionExists.c.o: In function `main':
    CheckFunctionExists.c:(.text+0x15): undefined reference to `read_real_time'
    collect2: ld 返回 1
    gmake[1]: *** [cmTryCompileExec2662387648] 错误 1
    gmake[1]: Leaving directory `/root/lnmp/src/mysql-5.6.16/CMakeFiles/CMakeTmp'
    gmake: *** [cmTryCompileExec2662387648/fast] 错误 2


    Determining if the function rdtscll exists failed with the following output:
    Change Dir: /root/lnmp/src/mysql-5.6.16/CMakeFiles/CMakeTmp

    Run Build Command:/usr/bin/gmake "cmTryCompileExec2849182874/fast"
    /usr/bin/gmake -f CMakeFiles/cmTryCompileExec2849182874.dir/build.make CMakeFiles/cmTryCompileExec2849182874.dir/build
    gmake[1]: Entering directory `/root/lnmp/src/mysql-5.6.16/CMakeFiles/CMakeTmp'
    /usr/local/bin/cmake -E cmake_progress_report /root/lnmp/src/mysql-5.6.16/CMakeFiles/CMakeTmp/CMakeFiles 1
    Building C object CMakeFiles/cmTryCompileExec2849182874.dir/CheckFunctionExists.c.o
    /usr/bin/cc -Wall -DCHECK_FUNCTION_EXISTS=rdtscll -o CMakeFiles/cmTryCompileExec2849182874.dir/CheckFunctionExists.c.o -c /usr/local/share/cmake-2.8/Modules/CheckFunctionExists.c
    Linking C executable cmTryCompileExec2849182874
    /usr/local/bin/cmake -E cmake_link_script CMakeFiles/cmTryCompileExec2849182874.dir/link.txt --verbose=1
    /usr/bin/cc -Wall -DCHECK_FUNCTION_EXISTS=rdtscll CMakeFiles/cmTryCompileExec2849182874.dir/CheckFunctionExists.c.o -o cmTryCompileExec2849182874 -rdynamic -lm -lcrypt -ldl -lpthread -lrt
    CMakeFiles/cmTryCompileExec2849182874.dir/CheckFunctionExists.c.o: In function `main':
    CheckFunctionExists.c:(.text+0x15): undefined reference to `rdtscll'
    collect2: ld 返回 1
    gmake[1]: *** [cmTryCompileExec2849182874] 错误 1
    gmake[1]: Leaving directory `/root/lnmp/src/mysql-5.6.16/CMakeFiles/CMakeTmp'
    gmake: *** [cmTryCompileExec2849182874/fast] 错误 2


    Determining if the TIOCSTAT exist failed with the following output:
    Change Dir: /root/lnmp/src/mysql-5.6.16/CMakeFiles/CMakeTmp

    Run Build Command:/usr/bin/gmake "cmTryCompileExec4222901805/fast"
    /usr/bin/gmake -f CMakeFiles/cmTryCompileExec4222901805.dir/build.make CMakeFiles/cmTryCompileExec4222901805.dir/build
    gmake[1]: Entering directory `/root/lnmp/src/mysql-5.6.16/CMakeFiles/CMakeTmp'
    /usr/local/bin/cmake -E cmake_progress_report /root/lnmp/src/mysql-5.6.16/CMakeFiles/CMakeTmp/CMakeFiles 1
    Building C object CMakeFiles/cmTryCompileExec4222901805.dir/CheckSymbolExists.c.o
    /usr/bin/cc -Wall -o CMakeFiles/cmTryCompileExec4222901805.dir/CheckSymbolExists.c.o -c /root/lnmp/src/mysql-5.6.16/CMakeFiles/CMakeTmp/CheckSymbolExists.c
    /root/lnmp/src/mysql-5.6.16/CMakeFiles/CMakeTmp/CheckSymbolExists.c: 在函数‘main’中:
    /root/lnmp/src/mysql-5.6.16/CMakeFiles/CMakeTmp/CheckSymbolExists.c:8: 错误:‘TIOCSTAT’未声明(在此函数内第一次使用)
    /root/lnmp/src/mysql-5.6.16/CMakeFiles/CMakeTmp/CheckSymbolExists.c:8: 错误:(即使在一个函数内多次出现,每个未声明的标识符在其
    /root/lnmp/src/mysql-5.6.16/CMakeFiles/CMakeTmp/CheckSymbolExists.c:8: 错误:所在的函数内也只报告一次。)
    gmake[1]: Leaving directory `/root/lnmp/src/mysql-5.6.16/CMakeFiles/CMakeTmp'
    gmake[1]: *** [CMakeFiles/cmTryCompileExec4222901805.dir/CheckSymbolExists.c.o] 错误 1
    gmake: *** [cmTryCompileExec4222901805/fast] 错误 2

    File /root/lnmp/src/mysql-5.6.16/CMakeFiles/CMakeTmp/CheckSymbolExists.c:
    /* */
    #include <sys/ioctl.h>

    int main(int argc, char** argv)
    {
    (void)argv;
    #ifndef TIOCSTAT
    return ((int*)(&TIOCSTAT))[argc];
    #else
    (void)argc;
    return 0;
    #endif
    }

    Determining if the FIONREAD exist failed with the following output:
    Change Dir: /root/lnmp/src/mysql-5.6.16/CMakeFiles/CMakeTmp

    Run Build Command:/usr/bin/gmake "cmTryCompileExec1858500078/fast"
    /usr/bin/gmake -f CMakeFiles/cmTryCompileExec1858500078.dir/build.make CMakeFiles/cmTryCompileExec1858500078.dir/build
    gmake[1]: Entering directory `/root/lnmp/src/mysql-5.6.16/CMakeFiles/CMakeTmp'
    /usr/local/bin/cmake -E cmake_progress_report /root/lnmp/src/mysql-5.6.16/CMakeFiles/CMakeTmp/CMakeFiles 1
    Building C object CMakeFiles/cmTryCompileExec1858500078.dir/CheckSymbolExists.c.o
    /usr/bin/cc -Wall -o CMakeFiles/cmTryCompileExec1858500078.dir/CheckSymbolExists.c.o -c /root/lnmp/src/mysql-5.6.16/CMakeFiles/CMakeTmp/CheckSymbolExists.c
    /root/lnmp/src/mysql-5.6.16/CMakeFiles/CMakeTmp/CheckSymbolExists.c:2:23: 错误:sys/filio.h:没有那个文件或目录
    /root/lnmp/src/mysql-5.6.16/CMakeFiles/CMakeTmp/CheckSymbolExists.c: 在函数‘main’中:
    /root/lnmp/src/mysql-5.6.16/CMakeFiles/CMakeTmp/CheckSymbolExists.c:8: 错误:‘FIONREAD’未声明(在此函数内第一次使用)
    /root/lnmp/src/mysql-5.6.16/CMakeFiles/CMakeTmp/CheckSymbolExists.c:8: 错误:(即使在一个函数内多次出现,每个未声明的标识符在其
    /root/lnmp/src/mysql-5.6.16/CMakeFiles/CMakeTmp/CheckSymbolExists.c:8: 错误:所在的函数内也只报告一次。)
    gmake[1]: *** [CMakeFiles/cmTryCompileExec1858500078.dir/CheckSymbolExists.c.o] 错误 1
    gmake[1]: Leaving directory `/root/lnmp/src/mysql-5.6.16/CMakeFiles/CMakeTmp'
    gmake: *** [cmTryCompileExec1858500078/fast] 错误 2

    File /root/lnmp/src/mysql-5.6.16/CMakeFiles/CMakeTmp/CheckSymbolExists.c:
    /* */
    #include <sys/filio.h>

    int main(int argc, char** argv)
    {
    (void)argv;
    #ifndef FIONREAD
    return ((int*)(&FIONREAD))[argc];
    #else
    (void)argc;
    return 0;
    #endif
    }

    Determining if the system is big endian passed with the following output:
    Change Dir: /root/lnmp/src/mysql-5.6.16/CMakeFiles/CMakeTmp

    Run Build Command:/usr/bin/gmake "cmTryCompileExec2534468329/fast"
    /usr/bin/gmake -f CMakeFiles/cmTryCompileExec2534468329.dir/build.make CMakeFiles/cmTryCompileExec2534468329.dir/build
    gmake[1]: Entering directory `/root/lnmp/src/mysql-5.6.16/CMakeFiles/CMakeTmp'
    /usr/local/bin/cmake -E cmake_progress_report /root/lnmp/src/mysql-5.6.16/CMakeFiles/CMakeTmp/CMakeFiles 1
    Building C object CMakeFiles/cmTryCompileExec2534468329.dir/TestEndianess.c.o
    /usr/bin/cc -Wall -o CMakeFiles/cmTryCompileExec2534468329.dir/TestEndianess.c.o -c /root/lnmp/src/mysql-5.6.16/CMakeFiles/CMakeTmp/TestEndianess.c
    Linking C executable cmTryCompileExec2534468329
    /usr/local/bin/cmake -E cmake_link_script CMakeFiles/cmTryCompileExec2534468329.dir/link.txt --verbose=1
    /usr/bin/cc -Wall CMakeFiles/cmTryCompileExec2534468329.dir/TestEndianess.c.o -o cmTryCompileExec2534468329 -rdynamic
    gmake[1]: Leaving directory `/root/lnmp/src/mysql-5.6.16/CMakeFiles/CMakeTmp'

    TestEndianess.c:
    /* A 16 bit integer is required. */
    typedef unsigned short cmakeint16;

    /* On a little endian machine, these 16bit ints will give "THIS IS LITTLE ENDIAN."
    On a big endian machine the characters will be exchanged pairwise. */
    const cmakeint16 info_little[] = {0x4854, 0x5349, 0x4920, 0x2053, 0x494c, 0x5454, 0x454c, 0x4520, 0x444e, 0x4149, 0x2e4e, 0x0000};

    /* on a big endian machine, these 16bit ints will give "THIS IS BIG ENDIAN."
    On a little endian machine the characters will be exchanged pairwise. */
    const cmakeint16 info_big[] = {0x5448, 0x4953, 0x2049, 0x5320, 0x4249, 0x4720, 0x454e, 0x4449, 0x414e, 0x2e2e, 0x0000};

    #ifdef __CLASSIC_C__
    int main(argc, argv) int argc; char *argv[];
    #else
    int main(int argc, char *argv[])
    #endif
    {
    int require = 0;
    require += info_little[argc];
    require += info_big[argc];
    (void)argv;
    return require;
    }


    Determining size of uchar failed with the following output:
    Change Dir: /root/lnmp/src/mysql-5.6.16/CMakeFiles/CMakeTmp

    Run Build Command:/usr/bin/gmake "cmTryCompileExec1404792875/fast"
    /usr/bin/gmake -f CMakeFiles/cmTryCompileExec1404792875.dir/build.make CMakeFiles/cmTryCompileExec1404792875.dir/build
    gmake[1]: Entering directory `/root/lnmp/src/mysql-5.6.16/CMakeFiles/CMakeTmp'
    /usr/local/bin/cmake -E cmake_progress_report /root/lnmp/src/mysql-5.6.16/CMakeFiles/CMakeTmp/CMakeFiles 1
    Building C object CMakeFiles/cmTryCompileExec1404792875.dir/SIZEOF_UCHAR.c.o
    /usr/bin/cc -D_FILE_OFFSET_BITS=64 -D_LARGEFILE_SOURCE -D_LARGE_FILES -D__STDC_CONSTANT_MACROS -D__STDC_FORMAT_MACROS -D__STDC_LIMIT_MACROS -Wall -o CMakeFiles/cmTryCompileExec1404792875.dir/SIZEOF_UCHAR.c.o -c /root/lnmp/src/mysql-5.6.16/CMakeFiles/CheckTypeSize/SIZEOF_UCHAR.c
    /root/lnmp/src/mysql-5.6.16/CMakeFiles/CheckTypeSize/SIZEOF_UCHAR.c:21: 错误:‘uchar’未声明(不在函数内)
    gmake[1]: *** [CMakeFiles/cmTryCompileExec1404792875.dir/SIZEOF_UCHAR.c.o] 错误 1
    gmake[1]: Leaving directory `/root/lnmp/src/mysql-5.6.16/CMakeFiles/CMakeTmp'
    gmake: *** [cmTryCompileExec1404792875/fast] 错误 2

    /root/lnmp/src/mysql-5.6.16/CMakeFiles/CheckTypeSize/SIZEOF_UCHAR.c:
    #include <sys/types.h>
    #include <stdint.h>
    #include <stddef.h>
    #include "stdio.h"
    #include "sys/types.h"


    #undef KEY
    #if defined(__i386)
    # define KEY '_','_','i','3','8','6'
    #elif defined(__x86_64)
    # define KEY '_','_','x','8','6','_','6','4'
    #elif defined(__ppc__)
    # define KEY '_','_','p','p','c','_','_'
    #elif defined(__ppc64__)
    # define KEY '_','_','p','p','c','6','4','_','_'
    #endif

    #define SIZE (sizeof(uchar))
    char info_size[] = {'I', 'N', 'F', 'O', ':', 's','i','z','e','[',
    ('0' + ((SIZE / 10000)%10)),
    ('0' + ((SIZE / 1000)%10)),
    ('0' + ((SIZE / 100)%10)),
    ('0' + ((SIZE / 10)%10)),
    ('0' + (SIZE % 10)),
    ']',
    #ifdef KEY
    ' ','k','e','y','[', KEY, ']',
    #endif
    '\0'};

    #ifdef __CLASSIC_C__
    int main(argc, argv) int argc; char *argv[];
    #else
    int main(int argc, char *argv[])
    #endif
    {
    int require = 0;
    require += info_size[argc];
    (void)argv;
    return require;
    }


    Determining size of int8 failed with the following output:
    Change Dir: /root/lnmp/src/mysql-5.6.16/CMakeFiles/CMakeTmp

    Run Build Command:/usr/bin/gmake "cmTryCompileExec4142734369/fast"
    /usr/bin/gmake -f CMakeFiles/cmTryCompileExec4142734369.dir/build.make CMakeFiles/cmTryCompileExec4142734369.dir/build
    gmake[1]: Entering directory `/root/lnmp/src/mysql-5.6.16/CMakeFiles/CMakeTmp'
    /usr/local/bin/cmake -E cmake_progress_report /root/lnmp/src/mysql-5.6.16/CMakeFiles/CMakeTmp/CMakeFiles 1
    Building C object CMakeFiles/cmTryCompileExec4142734369.dir/SIZEOF_INT8.c.o
    /usr/bin/cc -D_FILE_OFFSET_BITS=64 -D_LARGEFILE_SOURCE -D_LARGE_FILES -D__STDC_CONSTANT_MACROS -D__STDC_FORMAT_MACROS -D__STDC_LIMIT_MACROS -Wall -o CMakeFiles/cmTryCompileExec4142734369.dir/SIZEOF_INT8.c.o -c /root/lnmp/src/mysql-5.6.16/CMakeFiles/CheckTypeSize/SIZEOF_INT8.c
    /root/lnmp/src/mysql-5.6.16/CMakeFiles/CheckTypeSize/SIZEOF_INT8.c:21: 错误:‘int8’未声明(不在函数内)
    gmake[1]: *** [CMakeFiles/cmTryCompileExec4142734369.dir/SIZEOF_INT8.c.o] 错误 1
    gmake[1]: Leaving directory `/root/lnmp/src/mysql-5.6.16/CMakeFiles/CMakeTmp'
    gmake: *** [cmTryCompileExec4142734369/fast] 错误 2

    /root/lnmp/src/mysql-5.6.16/CMakeFiles/CheckTypeSize/SIZEOF_INT8.c:
    #include <sys/types.h>
    #include <stdint.h>
    #include <stddef.h>
    #include "stdio.h"
    #include "sys/types.h"


    #undef KEY
    #if defined(__i386)
    # define KEY '_','_','i','3','8','6'
    #elif defined(__x86_64)
    # define KEY '_','_','x','8','6','_','6','4'
    #elif defined(__ppc__)
    # define KEY '_','_','p','p','c','_','_'
    #elif defined(__ppc64__)
    # define KEY '_','_','p','p','c','6','4','_','_'
    #endif

    #define SIZE (sizeof(int8))
    char info_size[] = {'I', 'N', 'F', 'O', ':', 's','i','z','e','[',
    ('0' + ((SIZE / 10000)%10)),
    ('0' + ((SIZE / 1000)%10)),
    ('0' + ((SIZE / 100)%10)),
    ('0' + ((SIZE / 10)%10)),
    ('0' + (SIZE % 10)),
    ']',
    #ifdef KEY
    ' ','k','e','y','[', KEY, ']',
    #endif
    '\0'};

    #ifdef __CLASSIC_C__
    int main(argc, argv) int argc; char *argv[];
    #else
    int main(int argc, char *argv[])
    #endif
    {
    int require = 0;
    require += info_size[argc];
    (void)argv;
    return require;
    }


    Determining size of uint8 failed with the following output:
    Change Dir: /root/lnmp/src/mysql-5.6.16/CMakeFiles/CMakeTmp

    Run Build Command:/usr/bin/gmake "cmTryCompileExec2416984714/fast"
    /usr/bin/gmake -f CMakeFiles/cmTryCompileExec2416984714.dir/build.make CMakeFiles/cmTryCompileExec2416984714.dir/build
    gmake[1]: Entering directory `/root/lnmp/src/mysql-5.6.16/CMakeFiles/CMakeTmp'
    /usr/local/bin/cmake -E cmake_progress_report /root/lnmp/src/mysql-5.6.16/CMakeFiles/CMakeTmp/CMakeFiles 1
    Building C object CMakeFiles/cmTryCompileExec2416984714.dir/SIZEOF_UINT8.c.o
    /usr/bin/cc -D_FILE_OFFSET_BITS=64 -D_LARGEFILE_SOURCE -D_LARGE_FILES -D__STDC_CONSTANT_MACROS -D__STDC_FORMAT_MACROS -D__STDC_LIMIT_MACROS -Wall -o CMakeFiles/cmTryCompileExec2416984714.dir/SIZEOF_UINT8.c.o -c /root/lnmp/src/mysql-5.6.16/CMakeFiles/CheckTypeSize/SIZEOF_UINT8.c
    /root/lnmp/src/mysql-5.6.16/CMakeFiles/CheckTypeSize/SIZEOF_UINT8.c:21: 错误:‘uint8’未声明(不在函数内)
    gmake[1]: *** [CMakeFiles/cmTryCompileExec2416984714.dir/SIZEOF_UINT8.c.o] 错误 1
    gmake[1]: Leaving directory `/root/lnmp/src/mysql-5.6.16/CMakeFiles/CMakeTmp'
    gmake: *** [cmTryCompileExec2416984714/fast] 错误 2

    /root/lnmp/src/mysql-5.6.16/CMakeFiles/CheckTypeSize/SIZEOF_UINT8.c:
    #include <sys/types.h>
    #include <stdint.h>
    #include <stddef.h>
    #include "stdio.h"
    #include "sys/types.h"


    #undef KEY
    #if defined(__i386)
    # define KEY '_','_','i','3','8','6'
    #elif defined(__x86_64)
    # define KEY '_','_','x','8','6','_','6','4'
    #elif defined(__ppc__)
    # define KEY '_','_','p','p','c','_','_'
    #elif defined(__ppc64__)
    # define KEY '_','_','p','p','c','6','4','_','_'
    #endif

    #define SIZE (sizeof(uint8))
    char info_size[] = {'I', 'N', 'F', 'O', ':', 's','i','z','e','[',
    ('0' + ((SIZE / 10000)%10)),
    ('0' + ((SIZE / 1000)%10)),
    ('0' + ((SIZE / 100)%10)),
    ('0' + ((SIZE / 10)%10)),
    ('0' + (SIZE % 10)),
    ']',
    #ifdef KEY
    ' ','k','e','y','[', KEY, ']',
    #endif
    '\0'};

    #ifdef __CLASSIC_C__
    int main(argc, argv) int argc; char *argv[];
    #else
    int main(int argc, char *argv[])
    #endif
    {
    int require = 0;
    require += info_size[argc];
    (void)argv;
    return require;
    }


    Determining size of int16 failed with the following output:
    Change Dir: /root/lnmp/src/mysql-5.6.16/CMakeFiles/CMakeTmp

    Run Build Command:/usr/bin/gmake "cmTryCompileExec2661407280/fast"
    /usr/bin/gmake -f CMakeFiles/cmTryCompileExec2661407280.dir/build.make CMakeFiles/cmTryCompileExec2661407280.dir/build
    gmake[1]: Entering directory `/root/lnmp/src/mysql-5.6.16/CMakeFiles/CMakeTmp'
    /usr/local/bin/cmake -E cmake_progress_report /root/lnmp/src/mysql-5.6.16/CMakeFiles/CMakeTmp/CMakeFiles 1
    Building C object CMakeFiles/cmTryCompileExec2661407280.dir/SIZEOF_INT16.c.o
    /usr/bin/cc -D_FILE_OFFSET_BITS=64 -D_LARGEFILE_SOURCE -D_LARGE_FILES -D__STDC_CONSTANT_MACROS -D__STDC_FORMAT_MACROS -D__STDC_LIMIT_MACROS -Wall -o CMakeFiles/cmTryCompileExec2661407280.dir/SIZEOF_INT16.c.o -c /root/lnmp/src/mysql-5.6.16/CMakeFiles/CheckTypeSize/SIZEOF_INT16.c
    /root/lnmp/src/mysql-5.6.16/CMakeFiles/CheckTypeSize/SIZEOF_INT16.c:21: 错误:‘int16’未声明(不在函数内)
    gmake[1]: *** [CMakeFiles/cmTryCompileExec2661407280.dir/SIZEOF_INT16.c.o] 错误 1
    gmake[1]: Leaving directory `/root/lnmp/src/mysql-5.6.16/CMakeFiles/CMakeTmp'
    gmake: *** [cmTryCompileExec2661407280/fast] 错误 2

    /root/lnmp/src/mysql-5.6.16/CMakeFiles/CheckTypeSize/SIZEOF_INT16.c:
    #include <sys/types.h>
    #include <stdint.h>
    #include <stddef.h>
    #include "stdio.h"
    #include "sys/types.h"


    #undef KEY
    #if defined(__i386)
    # define KEY '_','_','i','3','8','6'
    #elif defined(__x86_64)
    # define KEY '_','_','x','8','6','_','6','4'
    #elif defined(__ppc__)
    # define KEY '_','_','p','p','c','_','_'
    #elif defined(__ppc64__)
    # define KEY '_','_','p','p','c','6','4','_','_'
    #endif

    #define SIZE (sizeof(int16))
    char info_size[] = {'I', 'N', 'F', 'O', ':', 's','i','z','e','[',
    ('0' + ((SIZE / 10000)%10)),
    ('0' + ((SIZE / 1000)%10)),
    ('0' + ((SIZE / 100)%10)),
    ('0' + ((SIZE / 10)%10)),
    ('0' + (SIZE % 10)),
    ']',
    #ifdef KEY
    ' ','k','e','y','[', KEY, ']',
    #endif
    '\0'};

    #ifdef __CLASSIC_C__
    int main(argc, argv) int argc; char *argv[];
    #else
    int main(int argc, char *argv[])
    #endif
    {
    int require = 0;
    require += info_size[argc];
    (void)argv;
    return require;
    }


    Determining size of uint16 failed with the following output:
    Change Dir: /root/lnmp/src/mysql-5.6.16/CMakeFiles/CMakeTmp

    Run Build Command:/usr/bin/gmake "cmTryCompileExec3239648109/fast"
    /usr/bin/gmake -f CMakeFiles/cmTryCompileExec3239648109.dir/build.make CMakeFiles/cmTryCompileExec3239648109.dir/build
    gmake[1]: Entering directory `/root/lnmp/src/mysql-5.6.16/CMakeFiles/CMakeTmp'
    /usr/local/bin/cmake -E cmake_progress_report /root/lnmp/src/mysql-5.6.16/CMakeFiles/CMakeTmp/CMakeFiles 1
    Building C object CMakeFiles/cmTryCompileExec3239648109.dir/SIZEOF_UINT16.c.o
    /usr/bin/cc -D_FILE_OFFSET_BITS=64 -D_LARGEFILE_SOURCE -D_LARGE_FILES -D__STDC_CONSTANT_MACROS -D__STDC_FORMAT_MACROS -D__STDC_LIMIT_MACROS -Wall -o CMakeFiles/cmTryCompileExec3239648109.dir/SIZEOF_UINT16.c.o -c /root/lnmp/src/mysql-5.6.16/CMakeFiles/CheckTypeSize/SIZEOF_UINT16.c
    /root/lnmp/src/mysql-5.6.16/CMakeFiles/CheckTypeSize/SIZEOF_UINT16.c:21: 错误:‘uint16’未声明(不在函数内)
    gmake[1]: *** [CMakeFiles/cmTryCompileExec3239648109.dir/SIZEOF_UINT16.c.o] 错误 1
    gmake[1]: Leaving directory `/root/lnmp/src/mysql-5.6.16/CMakeFiles/CMakeTmp'
    gmake: *** [cmTryCompileExec3239648109/fast] 错误 2

    /root/lnmp/src/mysql-5.6.16/CMakeFiles/CheckTypeSize/SIZEOF_UINT16.c:
    #include <sys/types.h>
    #include <stdint.h>
    #include <stddef.h>
    #include "stdio.h"
    #include "sys/types.h"


    #undef KEY
    #if defined(__i386)
    # define KEY '_','_','i','3','8','6'
    #elif defined(__x86_64)
    # define KEY '_','_','x','8','6','_','6','4'
    #elif defined(__ppc__)
    # define KEY '_','_','p','p','c','_','_'
    #elif defined(__ppc64__)
    # define KEY '_','_','p','p','c','6','4','_','_'
    #endif

    #define SIZE (sizeof(uint16))
    char info_size[] = {'I', 'N', 'F', 'O', ':', 's','i','z','e','[',
    ('0' + ((SIZE / 10000)%10)),
    ('0' + ((SIZE / 1000)%10)),
    ('0' + ((SIZE / 100)%10)),
    ('0' + ((SIZE / 10)%10)),
    ('0' + (SIZE % 10)),
    ']',
    #ifdef KEY
    ' ','k','e','y','[', KEY, ']',
    #endif
    '\0'};

    #ifdef __CLASSIC_C__
    int main(argc, argv) int argc; char *argv[];
    #else
    int main(int argc, char *argv[])
    #endif
    {
    int require = 0;
    require += info_size[argc];
    (void)argv;
    return require;
    }


    Determining size of int32 failed with the following output:
    Change Dir: /root/lnmp/src/mysql-5.6.16/CMakeFiles/CMakeTmp

    Run Build Command:/usr/bin/gmake "cmTryCompileExec1268770417/fast"
    /usr/bin/gmake -f CMakeFiles/cmTryCompileExec1268770417.dir/build.make CMakeFiles/cmTryCompileExec1268770417.dir/build
    gmake[1]: Entering directory `/root/lnmp/src/mysql-5.6.16/CMakeFiles/CMakeTmp'
    /usr/local/bin/cmake -E cmake_progress_report /root/lnmp/src/mysql-5.6.16/CMakeFiles/CMakeTmp/CMakeFiles 1
    Building C object CMakeFiles/cmTryCompileExec1268770417.dir/SIZEOF_INT32.c.o
    /usr/bin/cc -D_FILE_OFFSET_BITS=64 -D_LARGEFILE_SOURCE -D_LARGE_FILES -D__STDC_CONSTANT_MACROS -D__STDC_FORMAT_MACROS -D__STDC_LIMIT_MACROS -Wall -o CMakeFiles/cmTryCompileExec1268770417.dir/SIZEOF_INT32.c.o -c /root/lnmp/src/mysql-5.6.16/CMakeFiles/CheckTypeSize/SIZEOF_INT32.c
    /root/lnmp/src/mysql-5.6.16/CMakeFiles/CheckTypeSize/SIZEOF_INT32.c:21: 错误:‘int32’未声明(不在函数内)
    gmake[1]: Leaving directory `/root/lnmp/src/mysql-5.6.16/CMakeFiles/CMakeTmp'
    gmake[1]: *** [CMakeFiles/cmTryCompileExec1268770417.dir/SIZEOF_INT32.c.o] 错误 1
    gmake: *** [cmTryCompileExec1268770417/fast] 错误 2

    /root/lnmp/src/mysql-5.6.16/CMakeFiles/CheckTypeSize/SIZEOF_INT32.c:
    #include <sys/types.h>
    #include <stdint.h>
    #include <stddef.h>
    #include "stdio.h"
    #include "sys/types.h"


    #undef KEY
    #if defined(__i386)
    # define KEY '_','_','i','3','8','6'
    #elif defined(__x86_64)
    # define KEY '_','_','x','8','6','_','6','4'
    #elif defined(__ppc__)
    # define KEY '_','_','p','p','c','_','_'
    #elif defined(__ppc64__)
    # define KEY '_','_','p','p','c','6','4','_','_'
    #endif

    #define SIZE (sizeof(int32))
    char info_size[] = {'I', 'N', 'F', 'O', ':', 's','i','z','e','[',
    ('0' + ((SIZE / 10000)%10)),
    ('0' + ((SIZE / 1000)%10)),
    ('0' + ((SIZE / 100)%10)),
    ('0' + ((SIZE / 10)%10)),
    ('0' + (SIZE % 10)),
    ']',
    #ifdef KEY
    ' ','k','e','y','[', KEY, ']',
    #endif
    '\0'};

    #ifdef __CLASSIC_C__
    int main(argc, argv) int argc; char *argv[];
    #else
    int main(int argc, char *argv[])
    #endif
    {
    int require = 0;
    require += info_size[argc];
    (void)argv;
    return require;
    }


    Determining size of uint32 failed with the following output:
    Change Dir: /root/lnmp/src/mysql-5.6.16/CMakeFiles/CMakeTmp

    Run Build Command:/usr/bin/gmake "cmTryCompileExec2181683965/fast"
    /usr/bin/gmake -f CMakeFiles/cmTryCompileExec2181683965.dir/build.make CMakeFiles/cmTryCompileExec2181683965.dir/build
    gmake[1]: Entering directory `/root/lnmp/src/mysql-5.6.16/CMakeFiles/CMakeTmp'
    /usr/local/bin/cmake -E cmake_progress_report /root/lnmp/src/mysql-5.6.16/CMakeFiles/CMakeTmp/CMakeFiles 1
    Building C object CMakeFiles/cmTryCompileExec2181683965.dir/SIZEOF_UINT32.c.o
    /usr/bin/cc -D_FILE_OFFSET_BITS=64 -D_LARGEFILE_SOURCE -D_LARGE_FILES -D__STDC_CONSTANT_MACROS -D__STDC_FORMAT_MACROS -D__STDC_LIMIT_MACROS -Wall -o CMakeFiles/cmTryCompileExec2181683965.dir/SIZEOF_UINT32.c.o -c /root/lnmp/src/mysql-5.6.16/CMakeFiles/CheckTypeSize/SIZEOF_UINT32.c
    /root/lnmp/src/mysql-5.6.16/CMakeFiles/CheckTypeSize/SIZEOF_UINT32.c:21: 错误:‘uint32’未声明(不在函数内)
    gmake[1]: *** [CMakeFiles/cmTryCompileExec2181683965.dir/SIZEOF_UINT32.c.o] 错误 1
    gmake[1]: Leaving directory `/root/lnmp/src/mysql-5.6.16/CMakeFiles/CMakeTmp'
    gmake: *** [cmTryCompileExec2181683965/fast] 错误 2

    /root/lnmp/src/mysql-5.6.16/CMakeFiles/CheckTypeSize/SIZEOF_UINT32.c:
    #include <sys/types.h>
    #include <stdint.h>
    #include <stddef.h>
    #include "stdio.h"
    #include "sys/types.h"


    #undef KEY
    #if defined(__i386)
    # define KEY '_','_','i','3','8','6'
    #elif defined(__x86_64)
    # define KEY '_','_','x','8','6','_','6','4'
    #elif defined(__ppc__)
    # define KEY '_','_','p','p','c','_','_'
    #elif defined(__ppc64__)
    # define KEY '_','_','p','p','c','6','4','_','_'
    #endif

    #define SIZE (sizeof(uint32))
    char info_size[] = {'I', 'N', 'F', 'O', ':', 's','i','z','e','[',
    ('0' + ((SIZE / 10000)%10)),
    ('0' + ((SIZE / 1000)%10)),
    ('0' + ((SIZE / 100)%10)),
    ('0' + ((SIZE / 10)%10)),
    ('0' + (SIZE % 10)),
    ']',
    #ifdef KEY
    ' ','k','e','y','[', KEY, ']',
    #endif
    '\0'};

    #ifdef __CLASSIC_C__
    int main(argc, argv) int argc; char *argv[];
    #else
    int main(int argc, char *argv[])
    #endif
    {
    int require = 0;
    require += info_size[argc];
    (void)argv;
    return require;
    }


    Determining size of int64 failed with the following output:
    Change Dir: /root/lnmp/src/mysql-5.6.16/CMakeFiles/CMakeTmp

    Run Build Command:/usr/bin/gmake "cmTryCompileExec2118797641/fast"
    /usr/bin/gmake -f CMakeFiles/cmTryCompileExec2118797641.dir/build.make CMakeFiles/cmTryCompileExec2118797641.dir/build
    gmake[1]: Entering directory `/root/lnmp/src/mysql-5.6.16/CMakeFiles/CMakeTmp'
    /usr/local/bin/cmake -E cmake_progress_report /root/lnmp/src/mysql-5.6.16/CMakeFiles/CMakeTmp/CMakeFiles 1
    Building C object CMakeFiles/cmTryCompileExec2118797641.dir/SIZEOF_INT64.c.o
    /usr/bin/cc -D_FILE_OFFSET_BITS=64 -D_LARGEFILE_SOURCE -D_LARGE_FILES -D__STDC_CONSTANT_MACROS -D__STDC_FORMAT_MACROS -D__STDC_LIMIT_MACROS -Wall -o CMakeFiles/cmTryCompileExec2118797641.dir/SIZEOF_INT64.c.o -c /root/lnmp/src/mysql-5.6.16/CMakeFiles/CheckTypeSize/SIZEOF_INT64.c
    /root/lnmp/src/mysql-5.6.16/CMakeFiles/CheckTypeSize/SIZEOF_INT64.c:21: 错误:‘int64’未声明(不在函数内)
    gmake[1]: *** [CMakeFiles/cmTryCompileExec2118797641.dir/SIZEOF_INT64.c.o] 错误 1
    gmake[1]: Leaving directory `/root/lnmp/src/mysql-5.6.16/CMakeFiles/CMakeTmp'
    gmake: *** [cmTryCompileExec2118797641/fast] 错误 2

    /root/lnmp/src/mysql-5.6.16/CMakeFiles/CheckTypeSize/SIZEOF_INT64.c:
    #include <sys/types.h>
    #include <stdint.h>
    #include <stddef.h>
    #include "stdio.h"
    #include "sys/types.h"


    #undef KEY
    #if defined(__i386)
    # define KEY '_','_','i','3','8','6'
    #elif defined(__x86_64)
    # define KEY '_','_','x','8','6','_','6','4'
    #elif defined(__ppc__)
    # define KEY '_','_','p','p','c','_','_'
    #elif defined(__ppc64__)
    # define KEY '_','_','p','p','c','6','4','_','_'
    #endif

    #define SIZE (sizeof(int64))
    char info_size[] = {'I', 'N', 'F', 'O', ':', 's','i','z','e','[',
    ('0' + ((SIZE / 10000)%10)),
    ('0' + ((SIZE / 1000)%10)),
    ('0' + ((SIZE / 100)%10)),
    ('0' + ((SIZE / 10)%10)),
    ('0' + (SIZE % 10)),
    ']',
    #ifdef KEY
    ' ','k','e','y','[', KEY, ']',
    #endif
    '\0'};

    #ifdef __CLASSIC_C__
    int main(argc, argv) int argc; char *argv[];
    #else
    int main(int argc, char *argv[])
    #endif
    {
    int require = 0;
    require += info_size[argc];
    (void)argv;
    return require;
    }


    Determining size of uint64 failed with the following output:
    Change Dir: /root/lnmp/src/mysql-5.6.16/CMakeFiles/CMakeTmp

    Run Build Command:/usr/bin/gmake "cmTryCompileExec3369441110/fast"
    /usr/bin/gmake -f CMakeFiles/cmTryCompileExec3369441110.dir/build.make CMakeFiles/cmTryCompileExec3369441110.dir/build
    gmake[1]: Entering directory `/root/lnmp/src/mysql-5.6.16/CMakeFiles/CMakeTmp'
    /usr/local/bin/cmake -E cmake_progress_report /root/lnmp/src/mysql-5.6.16/CMakeFiles/CMakeTmp/CMakeFiles 1
    Building C object CMakeFiles/cmTryCompileExec3369441110.dir/SIZEOF_UINT64.c.o
    /usr/bin/cc -D_FILE_OFFSET_BITS=64 -D_LARGEFILE_SOURCE -D_LARGE_FILES -D__STDC_CONSTANT_MACROS -D__STDC_FORMAT_MACROS -D__STDC_LIMIT_MACROS -Wall -o CMakeFiles/cmTryCompileExec3369441110.dir/SIZEOF_UINT64.c.o -c /root/lnmp/src/mysql-5.6.16/CMakeFiles/CheckTypeSize/SIZEOF_UINT64.c
    /root/lnmp/src/mysql-5.6.16/CMakeFiles/CheckTypeSize/SIZEOF_UINT64.c:21: 错误:‘uint64’未声明(不在函数内)
    gmake[1]: Leaving directory `/root/lnmp/src/mysql-5.6.16/CMakeFiles/CMakeTmp'
    gmake[1]: *** [CMakeFiles/cmTryCompileExec3369441110.dir/SIZEOF_UINT64.c.o] 错误 1
    gmake: *** [cmTryCompileExec3369441110/fast] 错误 2

    /root/lnmp/src/mysql-5.6.16/CMakeFiles/CheckTypeSize/SIZEOF_UINT64.c:
    #include <sys/types.h>
    #include <stdint.h>
    #include <stddef.h>
    #include "stdio.h"
    #include "sys/types.h"


    #undef KEY
    #if defined(__i386)
    # define KEY '_','_','i','3','8','6'
    #elif defined(__x86_64)
    # define KEY '_','_','x','8','6','_','6','4'
    #elif defined(__ppc__)
    # define KEY '_','_','p','p','c','_','_'
    #elif defined(__ppc64__)
    # define KEY '_','_','p','p','c','6','4','_','_'
    #endif

    #define SIZE (sizeof(uint64))
    char info_size[] = {'I', 'N', 'F', 'O', ':', 's','i','z','e','[',
    ('0' + ((SIZE / 10000)%10)),
    ('0' + ((SIZE / 1000)%10)),
    ('0' + ((SIZE / 100)%10)),
    ('0' + ((SIZE / 10)%10)),
    ('0' + (SIZE % 10)),
    ']',
    #ifdef KEY
    ' ','k','e','y','[', KEY, ']',
    #endif
    '\0'};

    #ifdef __CLASSIC_C__
    int main(argc, argv) int argc; char *argv[];
    #else
    int main(int argc, char *argv[])
    #endif
    {
    int require = 0;
    require += info_size[argc];
    (void)argv;
    return require;
    }


    Determining size of bool failed with the following output:
    Change Dir: /root/lnmp/src/mysql-5.6.16/CMakeFiles/CMakeTmp

    Run Build Command:/usr/bin/gmake "cmTryCompileExec3116221354/fast"
    /usr/bin/gmake -f CMakeFiles/cmTryCompileExec3116221354.dir/build.make CMakeFiles/cmTryCompileExec3116221354.dir/build
    gmake[1]: Entering directory `/root/lnmp/src/mysql-5.6.16/CMakeFiles/CMakeTmp'
    /usr/local/bin/cmake -E cmake_progress_report /root/lnmp/src/mysql-5.6.16/CMakeFiles/CMakeTmp/CMakeFiles 1
    Building C object CMakeFiles/cmTryCompileExec3116221354.dir/SIZEOF_BOOL.c.o
    /usr/bin/cc -D_FILE_OFFSET_BITS=64 -D_LARGEFILE_SOURCE -D_LARGE_FILES -D__STDC_CONSTANT_MACROS -D__STDC_FORMAT_MACROS -D__STDC_LIMIT_MACROS -Wall -o CMakeFiles/cmTryCompileExec3116221354.dir/SIZEOF_BOOL.c.o -c /root/lnmp/src/mysql-5.6.16/CMakeFiles/CheckTypeSize/SIZEOF_BOOL.c
    /root/lnmp/src/mysql-5.6.16/CMakeFiles/CheckTypeSize/SIZEOF_BOOL.c:20: 错误:‘bool’未声明(不在函数内)
    gmake[1]: *** [CMakeFiles/cmTryCompileExec3116221354.dir/SIZEOF_BOOL.c.o] 错误 1
    gmake[1]: Leaving directory `/root/lnmp/src/mysql-5.6.16/CMakeFiles/CMakeTmp'
    gmake: *** [cmTryCompileExec3116221354/fast] 错误 2

    /root/lnmp/src/mysql-5.6.16/CMakeFiles/CheckTypeSize/SIZEOF_BOOL.c:
    #include <sys/types.h>
    #include <stdint.h>
    #include <stddef.h>
    #include "sys/types.h"


    #undef KEY
    #if defined(__i386)
    # define KEY '_','_','i','3','8','6'
    #elif defined(__x86_64)
    # define KEY '_','_','x','8','6','_','6','4'
    #elif defined(__ppc__)
    # define KEY '_','_','p','p','c','_','_'
    #elif defined(__ppc64__)
    # define KEY '_','_','p','p','c','6','4','_','_'
    #endif

    #define SIZE (sizeof(bool))
    char info_size[] = {'I', 'N', 'F', 'O', ':', 's','i','z','e','[',
    ('0' + ((SIZE / 10000)%10)),
    ('0' + ((SIZE / 1000)%10)),
    ('0' + ((SIZE / 100)%10)),
    ('0' + ((SIZE / 10)%10)),
    ('0' + (SIZE % 10)),
    ']',
    #ifdef KEY
    ' ','k','e','y','[', KEY, ']',
    #endif
    '\0'};

    #ifdef __CLASSIC_C__
    int main(argc, argv) int argc; char *argv[];
    #else
    int main(int argc, char *argv[])
    #endif
    {
    int require = 0;
    require += info_size[argc];
    (void)argv;
    return require;
    }


    Performing C SOURCE FILE Test TIME_T_UNSIGNED failed with the following output:
    Change Dir: /root/lnmp/src/mysql-5.6.16/CMakeFiles/CMakeTmp

    Run Build Command:/usr/bin/gmake "cmTryCompileExec37014413/fast"
    /usr/bin/gmake -f CMakeFiles/cmTryCompileExec37014413.dir/build.make CMakeFiles/cmTryCompileExec37014413.dir/build
    gmake[1]: Entering directory `/root/lnmp/src/mysql-5.6.16/CMakeFiles/CMakeTmp'
    /usr/local/bin/cmake -E cmake_progress_report /root/lnmp/src/mysql-5.6.16/CMakeFiles/CMakeTmp/CMakeFiles 1
    Building C object CMakeFiles/cmTryCompileExec37014413.dir/src.c.o
    /usr/bin/cc -D_FILE_OFFSET_BITS=64 -D_LARGEFILE_SOURCE -D_LARGE_FILES -D__STDC_CONSTANT_MACROS -D__STDC_FORMAT_MACROS -D__STDC_LIMIT_MACROS -Wall -DTIME_T_UNSIGNED -o CMakeFiles/cmTryCompileExec37014413.dir/src.c.o -c /root/lnmp/src/mysql-5.6.16/CMakeFiles/CMakeTmp/src.c
    /root/lnmp/src/mysql-5.6.16/CMakeFiles/CMakeTmp/src.c: 在函数‘main’中:
    /root/lnmp/src/mysql-5.6.16/CMakeFiles/CMakeTmp/src.c:5: 错误:数组‘array’的大小为负
    /root/lnmp/src/mysql-5.6.16/CMakeFiles/CMakeTmp/src.c:5: 警告:未使用的变量‘array’
    gmake[1]: Leaving directory `/root/lnmp/src/mysql-5.6.16/CMakeFiles/CMakeTmp'
    gmake[1]: *** [CMakeFiles/cmTryCompileExec37014413.dir/src.c.o] 错误 1
    gmake: *** [cmTryCompileExec37014413/fast] 错误 2

    Source file was:

    #include <time.h>
    int main()
    {
    int array[(((time_t)-1) > 0) ? 1 : -1];
    return 0;
    }
    Performing C SOURCE FILE Test HAVE_TIMESPEC_TS_SEC failed with the following output:
    Change Dir: /root/lnmp/src/mysql-5.6.16/CMakeFiles/CMakeTmp

    Run Build Command:/usr/bin/gmake "cmTryCompileExec2820383168/fast"
    /usr/bin/gmake -f CMakeFiles/cmTryCompileExec2820383168.dir/build.make CMakeFiles/cmTryCompileExec2820383168.dir/build
    gmake[1]: Entering directory `/root/lnmp/src/mysql-5.6.16/CMakeFiles/CMakeTmp'
    /usr/local/bin/cmake -E cmake_progress_report /root/lnmp/src/mysql-5.6.16/CMakeFiles/CMakeTmp/CMakeFiles 1
    Building C object CMakeFiles/cmTryCompileExec2820383168.dir/src.c.o
    /usr/bin/cc -D_FILE_OFFSET_BITS=64 -D_LARGEFILE_SOURCE -D_LARGE_FILES -D__STDC_CONSTANT_MACROS -D__STDC_FORMAT_MACROS -D__STDC_LIMIT_MACROS -Wall -DHAVE_TIMESPEC_TS_SEC -o CMakeFiles/cmTryCompileExec2820383168.dir/src.c.o -c /root/lnmp/src/mysql-5.6.16/CMakeFiles/CMakeTmp/src.c
    /root/lnmp/src/mysql-5.6.16/CMakeFiles/CMakeTmp/src.c: 在函数‘main’中:
    /root/lnmp/src/mysql-5.6.16/CMakeFiles/CMakeTmp/src.c:7: 错误:‘struct timespec’没有名为‘ts_sec’的成员
    /root/lnmp/src/mysql-5.6.16/CMakeFiles/CMakeTmp/src.c:8: 错误:‘struct timespec’没有名为‘ts_nsec’的成员
    gmake[1]: *** [CMakeFiles/cmTryCompileExec2820383168.dir/src.c.o] 错误 1
    gmake[1]: Leaving directory `/root/lnmp/src/mysql-5.6.16/CMakeFiles/CMakeTmp'
    gmake: *** [cmTryCompileExec2820383168/fast] 错误 2

    Source file was:

    #include <pthread.h>

    int main(int ac, char **av)
    {
    struct timespec abstime;
    abstime.ts_sec = time(NULL)+1;
    abstime.ts_nsec = 0;
    }

    Performing C++ SOURCE FILE Test HAVE_SOLARIS_STYLE_GETHOST failed with the following output:
    Change Dir: /root/lnmp/src/mysql-5.6.16/CMakeFiles/CMakeTmp

    Run Build Command:/usr/bin/gmake "cmTryCompileExec2252737859/fast"
    /usr/bin/gmake -f CMakeFiles/cmTryCompileExec2252737859.dir/build.make CMakeFiles/cmTryCompileExec2252737859.dir/build
    gmake[1]: Entering directory `/root/lnmp/src/mysql-5.6.16/CMakeFiles/CMakeTmp'
    /usr/local/bin/cmake -E cmake_progress_report /root/lnmp/src/mysql-5.6.16/CMakeFiles/CMakeTmp/CMakeFiles 1
    Building CXX object CMakeFiles/cmTryCompileExec2252737859.dir/src.cxx.o
    /usr/bin/c++ -D_FILE_OFFSET_BITS=64 -D_LARGEFILE_SOURCE -D_LARGE_FILES -D__STDC_CONSTANT_MACROS -D__STDC_FORMAT_MACROS -D__STDC_LIMIT_MACROS -Wall -Wno-unused-parameter -DHAVE_SOLARIS_STYLE_GETHOST -o CMakeFiles/cmTryCompileExec2252737859.dir/src.cxx.o -c /root/lnmp/src/mysql-5.6.16/CMakeFiles/CMakeTmp/src.cxx
    /root/lnmp/src/mysql-5.6.16/CMakeFiles/CMakeTmp/src.cxx: In function ‘int main()’:
    /root/lnmp/src/mysql-5.6.16/CMakeFiles/CMakeTmp/src.cxx:17: 错误:不能将‘int gethostbyaddr_r(const void*, __socklen_t, int, hostent*, char*, size_t, hostent**, int*)’的实参‘7’从‘int*’转换到‘hostent**’
    /root/lnmp/src/mysql-5.6.16/CMakeFiles/CMakeTmp/src.cxx:15: 警告:未使用的变量‘foo’
    gmake[1]: *** [CMakeFiles/cmTryCompileExec2252737859.dir/src.cxx.o] 错误 1
    gmake[1]: Leaving directory `/root/lnmp/src/mysql-5.6.16/CMakeFiles/CMakeTmp'
    gmake: *** [cmTryCompileExec2252737859/fast] 错误 2

    Source file was:

    #undef inline
    #if !defined(SCO) && !defined(__osf__) && !defined(_REENTRANT)
    #define _REENTRANT
    #endif
    #include <pthread.h>
    #include <sys/types.h>
    #include <sys/socket.h>
    #include <netinet/in.h>
    #include <arpa/inet.h>
    #include <netdb.h>
    int main()
    {

    struct hostent *foo =
    gethostbyaddr_r((const char *) 0,
    0, 0, (struct hostent *) 0, (char *) NULL, 0, (int *)0);
    return 0;
    }

    Determining if the include file netinet/in6.h exists failed with the following output:
    Change Dir: /root/lnmp/src/mysql-5.6.16/CMakeFiles/CMakeTmp

    Run Build Command:/usr/bin/gmake "cmTryCompileExec3583768636/fast"
    /usr/bin/gmake -f CMakeFiles/cmTryCompileExec3583768636.dir/build.make CMakeFiles/cmTryCompileExec3583768636.dir/build
    gmake[1]: Entering directory `/root/lnmp/src/mysql-5.6.16/CMakeFiles/CMakeTmp'
    /usr/local/bin/cmake -E cmake_progress_report /root/lnmp/src/mysql-5.6.16/CMakeFiles/CMakeTmp/CMakeFiles 1
    Building C object CMakeFiles/cmTryCompileExec3583768636.dir/CheckIncludeFile.c.o
    /usr/bin/cc -D_FILE_OFFSET_BITS=64 -D_LARGEFILE_SOURCE -D_LARGE_FILES -D__STDC_CONSTANT_MACROS -D__STDC_FORMAT_MACROS -D__STDC_LIMIT_MACROS -Wall -o CMakeFiles/cmTryCompileExec3583768636.dir/CheckIncludeFile.c.o -c /root/lnmp/src/mysql-5.6.16/CMakeFiles/CMakeTmp/CheckIncludeFile.c
    /root/lnmp/src/mysql-5.6.16/CMakeFiles/CMakeTmp/CheckIncludeFile.c:1:25: 错误:netinet/in6.h:没有那个文件或目录
    gmake[1]: *** [CMakeFiles/cmTryCompileExec3583768636.dir/CheckIncludeFile.c.o] 错误 1
    gmake[1]: Leaving directory `/root/lnmp/src/mysql-5.6.16/CMakeFiles/CMakeTmp'
    gmake: *** [cmTryCompileExec3583768636/fast] 错误 2


    Performing C SOURCE FILE Test HAVE_SOCKADDR_IN_SIN_LEN failed with the following output:
    Change Dir: /root/lnmp/src/mysql-5.6.16/CMakeFiles/CMakeTmp

    Run Build Command:/usr/bin/gmake "cmTryCompileExec443518111/fast"
    /usr/bin/gmake -f CMakeFiles/cmTryCompileExec443518111.dir/build.make CMakeFiles/cmTryCompileExec443518111.dir/build
    gmake[1]: Entering directory `/root/lnmp/src/mysql-5.6.16/CMakeFiles/CMakeTmp'
    /usr/local/bin/cmake -E cmake_progress_report /root/lnmp/src/mysql-5.6.16/CMakeFiles/CMakeTmp/CMakeFiles 1
    Building C object CMakeFiles/cmTryCompileExec443518111.dir/src.c.o
    /usr/bin/cc -D_FILE_OFFSET_BITS=64 -D_LARGEFILE_SOURCE -D_LARGE_FILES -D__STDC_CONSTANT_MACROS -D__STDC_FORMAT_MACROS -D__STDC_LIMIT_MACROS -Wall -DHAVE_SOCKADDR_IN_SIN_LEN -o CMakeFiles/cmTryCompileExec443518111.dir/src.c.o -c /root/lnmp/src/mysql-5.6.16/CMakeFiles/CMakeTmp/src.c
    /root/lnmp/src/mysql-5.6.16/CMakeFiles/CMakeTmp/src.c: 在函数‘main’中:
    /root/lnmp/src/mysql-5.6.16/CMakeFiles/CMakeTmp/src.c:9: 错误:‘struct sockaddr_in’没有名为‘sin_len’的成员
    gmake[1]: *** [CMakeFiles/cmTryCompileExec443518111.dir/src.c.o] 错误 1
    gmake[1]: Leaving directory `/root/lnmp/src/mysql-5.6.16/CMakeFiles/CMakeTmp'
    gmake: *** [cmTryCompileExec443518111/fast] 错误 2

    Source file was:

    #include <sys/types.h>
    #include <netinet/in.h>
    #include <sys/socket.h>

    int main()
    {
    struct sockaddr_in* tmp;
    tmp->sin_len;
    return 0;
    }

    Performing C SOURCE FILE Test HAVE_SOCKADDR_IN6_SIN6_LEN failed with the following output:
    Change Dir: /root/lnmp/src/mysql-5.6.16/CMakeFiles/CMakeTmp

    Run Build Command:/usr/bin/gmake "cmTryCompileExec1602032462/fast"
    /usr/bin/gmake -f CMakeFiles/cmTryCompileExec1602032462.dir/build.make CMakeFiles/cmTryCompileExec1602032462.dir/build
    gmake[1]: Entering directory `/root/lnmp/src/mysql-5.6.16/CMakeFiles/CMakeTmp'
    /usr/local/bin/cmake -E cmake_progress_report /root/lnmp/src/mysql-5.6.16/CMakeFiles/CMakeTmp/CMakeFiles 1
    Building C object CMakeFiles/cmTryCompileExec1602032462.dir/src.c.o
    /usr/bin/cc -D_FILE_OFFSET_BITS=64 -D_LARGEFILE_SOURCE -D_LARGE_FILES -D__STDC_CONSTANT_MACROS -D__STDC_FORMAT_MACROS -D__STDC_LIMIT_MACROS -Wall -DHAVE_SOCKADDR_IN6_SIN6_LEN -o CMakeFiles/cmTryCompileExec1602032462.dir/src.c.o -c /root/lnmp/src/mysql-5.6.16/CMakeFiles/CMakeTmp/src.c
    /root/lnmp/src/mysql-5.6.16/CMakeFiles/CMakeTmp/src.c: 在函数‘main’中:
    /root/lnmp/src/mysql-5.6.16/CMakeFiles/CMakeTmp/src.c:9: 错误:‘struct sockaddr_in6’没有名为‘sin6_len’的成员
    gmake[1]: *** [CMakeFiles/cmTryCompileExec1602032462.dir/src.c.o] 错误 1
    gmake[1]: Leaving directory `/root/lnmp/src/mysql-5.6.16/CMakeFiles/CMakeTmp'
    gmake: *** [cmTryCompileExec1602032462/fast] 错误 2

    Source file was:

    #include <sys/types.h>
    #include <netinet/in.h>
    #include <sys/socket.h>

    int main()
    {
    struct sockaddr_in6* tmp;
    tmp->sin6_len;
    return 0;
    }

    Performing C SOURCE FILE Test STRUCT_DIRENT_HAS_D_NAMLEN failed with the following output:
    Change Dir: /root/lnmp/src/mysql-5.6.16/CMakeFiles/CMakeTmp

    Run Build Command:/usr/bin/gmake "cmTryCompileExec3744975150/fast"
    /usr/bin/gmake -f CMakeFiles/cmTryCompileExec3744975150.dir/build.make CMakeFiles/cmTryCompileExec3744975150.dir/build
    gmake[1]: Entering directory `/root/lnmp/src/mysql-5.6.16/CMakeFiles/CMakeTmp'
    /usr/local/bin/cmake -E cmake_progress_report /root/lnmp/src/mysql-5.6.16/CMakeFiles/CMakeTmp/CMakeFiles 1
    Building C object CMakeFiles/cmTryCompileExec3744975150.dir/src.c.o
    /usr/bin/cc -D_FILE_OFFSET_BITS=64 -D_LARGEFILE_SOURCE -D_LARGE_FILES -D__STDC_CONSTANT_MACROS -D__STDC_FORMAT_MACROS -D__STDC_LIMIT_MACROS -Wall -DSTRUCT_DIRENT_HAS_D_NAMLEN -o CMakeFiles/cmTryCompileExec3744975150.dir/src.c.o -c /root/lnmp/src/mysql-5.6.16/CMakeFiles/CMakeTmp/src.c
    /root/lnmp/src/mysql-5.6.16/CMakeFiles/CMakeTmp/src.c: 在函数‘main’中:
    /root/lnmp/src/mysql-5.6.16/CMakeFiles/CMakeTmp/src.c:7: 错误:‘struct dirent’没有名为‘d_namlen’的成员
    gmake[1]: *** [CMakeFiles/cmTryCompileExec3744975150.dir/src.c.o] 错误 1
    gmake[1]: Leaving directory `/root/lnmp/src/mysql-5.6.16/CMakeFiles/CMakeTmp'
    gmake: *** [cmTryCompileExec3744975150/fast] 错误 2

    Source file was:

    #include <dirent.h>

    int main()
    {
    struct dirent* tmp;
    tmp->d_namlen;
    return 0;
    }

    Determining if the function mbscmp exists failed with the following output:
    Change Dir: /root/lnmp/src/mysql-5.6.16/CMakeFiles/CMakeTmp

    Run Build Command:/usr/bin/gmake "cmTryCompileExec3612159329/fast"
    /usr/bin/gmake -f CMakeFiles/cmTryCompileExec3612159329.dir/build.make CMakeFiles/cmTryCompileExec3612159329.dir/build
    gmake[1]: Entering directory `/root/lnmp/src/mysql-5.6.16/CMakeFiles/CMakeTmp'
    /usr/local/bin/cmake -E cmake_progress_report /root/lnmp/src/mysql-5.6.16/CMakeFiles/CMakeTmp/CMakeFiles 1
    Building C object CMakeFiles/cmTryCompileExec3612159329.dir/CheckFunctionExists.c.o
    /usr/bin/cc -D_FILE_OFFSET_BITS=64 -D_LARGEFILE_SOURCE -D_LARGE_FILES -D__STDC_CONSTANT_MACROS -D__STDC_FORMAT_MACROS -D__STDC_LIMIT_MACROS -Wall -DCHECK_FUNCTION_EXISTS=mbscmp -o CMakeFiles/cmTryCompileExec3612159329.dir/CheckFunctionExists.c.o -c /usr/local/share/cmake-2.8/Modules/CheckFunctionExists.c
    Linking C executable cmTryCompileExec3612159329
    /usr/local/bin/cmake -E cmake_link_script CMakeFiles/cmTryCompileExec3612159329.dir/link.txt --verbose=1
    /usr/bin/cc -Wall -DCHECK_FUNCTION_EXISTS=mbscmp CMakeFiles/cmTryCompileExec3612159329.dir/CheckFunctionExists.c.o -o cmTryCompileExec3612159329 -rdynamic -lm -lcrypt -ldl -lpthread -lrt
    CMakeFiles/cmTryCompileExec3612159329.dir/CheckFunctionExists.c.o: In function `main':
    CheckFunctionExists.c:(.text+0x15): undefined reference to `mbscmp'
    collect2: ld 返回 1
    gmake[1]: *** [cmTryCompileExec3612159329] 错误 1
    gmake[1]: Leaving directory `/root/lnmp/src/mysql-5.6.16/CMakeFiles/CMakeTmp'
    gmake: *** [cmTryCompileExec3612159329/fast] 错误 2


    Determining if the function strvis exists failed with the following output:
    Change Dir: /root/lnmp/src/mysql-5.6.16/CMakeFiles/CMakeTmp

    Run Build Command:/usr/bin/gmake "cmTryCompileExec3997258637/fast"
    /usr/bin/gmake -f CMakeFiles/cmTryCompileExec3997258637.dir/build.make CMakeFiles/cmTryCompileExec3997258637.dir/build
    gmake[1]: Entering directory `/root/lnmp/src/mysql-5.6.16/CMakeFiles/CMakeTmp'
    /usr/local/bin/cmake -E cmake_progress_report /root/lnmp/src/mysql-5.6.16/CMakeFiles/CMakeTmp/CMakeFiles 1
    Building C object CMakeFiles/cmTryCompileExec3997258637.dir/CheckFunctionExists.c.o
    /usr/bin/cc -D_FILE_OFFSET_BITS=64 -D_LARGEFILE_SOURCE -D_LARGE_FILES -D__STDC_CONSTANT_MACROS -D__STDC_FORMAT_MACROS -D__STDC_LIMIT_MACROS -Wall -DCHECK_FUNCTION_EXISTS=strvis -o CMakeFiles/cmTryCompileExec3997258637.dir/CheckFunctionExists.c.o -c /usr/local/share/cmake-2.8/Modules/CheckFunctionExists.c
    Linking C executable cmTryCompileExec3997258637
    /usr/local/bin/cmake -E cmake_link_script CMakeFiles/cmTryCompileExec3997258637.dir/link.txt --verbose=1
    /usr/bin/cc -Wall -DCHECK_FUNCTION_EXISTS=strvis CMakeFiles/cmTryCompileExec3997258637.dir/CheckFunctionExists.c.o -o cmTryCompileExec3997258637 -rdynamic
    CMakeFiles/cmTryCompileExec3997258637.dir/CheckFunctionExists.c.o: In function `main':
    CheckFunctionExists.c:(.text+0x15): undefined reference to `strvis'
    collect2: ld 返回 1
    gmake[1]: *** [cmTryCompileExec3997258637] 错误 1
    gmake[1]: Leaving directory `/root/lnmp/src/mysql-5.6.16/CMakeFiles/CMakeTmp'
    gmake: *** [cmTryCompileExec3997258637/fast] 错误 2


    Determining if the function strunvis exists failed with the following output:
    Change Dir: /root/lnmp/src/mysql-5.6.16/CMakeFiles/CMakeTmp

    Run Build Command:/usr/bin/gmake "cmTryCompileExec3749731042/fast"
    /usr/bin/gmake -f CMakeFiles/cmTryCompileExec3749731042.dir/build.make CMakeFiles/cmTryCompileExec3749731042.dir/build
    gmake[1]: Entering directory `/root/lnmp/src/mysql-5.6.16/CMakeFiles/CMakeTmp'
    /usr/local/bin/cmake -E cmake_progress_report /root/lnmp/src/mysql-5.6.16/CMakeFiles/CMakeTmp/CMakeFiles 1
    Building C object CMakeFiles/cmTryCompileExec3749731042.dir/CheckFunctionExists.c.o
    /usr/bin/cc -D_FILE_OFFSET_BITS=64 -D_LARGEFILE_SOURCE -D_LARGE_FILES -D__STDC_CONSTANT_MACROS -D__STDC_FORMAT_MACROS -D__STDC_LIMIT_MACROS -Wall -DCHECK_FUNCTION_EXISTS=strunvis -o CMakeFiles/cmTryCompileExec3749731042.dir/CheckFunctionExists.c.o -c /usr/local/share/cmake-2.8/Modules/CheckFunctionExists.c
    Linking C executable cmTryCompileExec3749731042
    /usr/local/bin/cmake -E cmake_link_script CMakeFiles/cmTryCompileExec3749731042.dir/link.txt --verbose=1
    /usr/bin/cc -Wall -DCHECK_FUNCTION_EXISTS=strunvis CMakeFiles/cmTryCompileExec3749731042.dir/CheckFunctionExists.c.o -o cmTryCompileExec3749731042 -rdynamic
    CMakeFiles/cmTryCompileExec3749731042.dir/CheckFunctionExists.c.o: In function `main':
    CheckFunctionExists.c:(.text+0x15): undefined reference to `strunvis'
    collect2: ld 返回 1
    gmake[1]: *** [cmTryCompileExec3749731042] 错误 1
    gmake[1]: Leaving directory `/root/lnmp/src/mysql-5.6.16/CMakeFiles/CMakeTmp'
    gmake: *** [cmTryCompileExec3749731042/fast] 错误 2


    Determining if files libaio.h exist failed with the following output:
    Change Dir: /root/lnmp/src/mysql-5.6.16/CMakeFiles/CMakeTmp

    Run Build Command:/usr/bin/gmake "cmTryCompileExec4103454099/fast"
    /usr/bin/gmake -f CMakeFiles/cmTryCompileExec4103454099.dir/build.make CMakeFiles/cmTryCompileExec4103454099.dir/build
    gmake[1]: Entering directory `/root/lnmp/src/mysql-5.6.16/CMakeFiles/CMakeTmp'
    /usr/local/bin/cmake -E cmake_progress_report /root/lnmp/src/mysql-5.6.16/CMakeFiles/CMakeTmp/CMakeFiles 1
    Building C object CMakeFiles/cmTryCompileExec4103454099.dir/CheckIncludeFiles.c.o
    /usr/bin/cc -D_FILE_OFFSET_BITS=64 -D_LARGEFILE_SOURCE -D_LARGE_FILES -D__STDC_CONSTANT_MACROS -D__STDC_FORMAT_MACROS -D__STDC_LIMIT_MACROS -Wall -o CMakeFiles/cmTryCompileExec4103454099.dir/CheckIncludeFiles.c.o -c /root/lnmp/src/mysql-5.6.16/CMakeFiles/CMakeTmp/CheckIncludeFiles.c
    /root/lnmp/src/mysql-5.6.16/CMakeFiles/CMakeTmp/CheckIncludeFiles.c:2:20: 错误:libaio.h:没有那个文件或目录
    gmake[1]: *** [CMakeFiles/cmTryCompileExec4103454099.dir/CheckIncludeFiles.c.o] 错误 1
    gmake[1]: Leaving directory `/root/lnmp/src/mysql-5.6.16/CMakeFiles/CMakeTmp'
    gmake: *** [cmTryCompileExec4103454099/fast] 错误 2

    Source:
    /* */
    #include <libaio.h>


    int main(){return 0;}

    Determining if the function io_queue_init exists in the aio failed with the following output:
    Change Dir: /root/lnmp/src/mysql-5.6.16/CMakeFiles/CMakeTmp

    Run Build Command:/usr/bin/gmake "cmTryCompileExec2420167172/fast"
    /usr/bin/gmake -f CMakeFiles/cmTryCompileExec2420167172.dir/build.make CMakeFiles/cmTryCompileExec2420167172.dir/build
    gmake[1]: Entering directory `/root/lnmp/src/mysql-5.6.16/CMakeFiles/CMakeTmp'
    /usr/local/bin/cmake -E cmake_progress_report /root/lnmp/src/mysql-5.6.16/CMakeFiles/CMakeTmp/CMakeFiles 1
    Building C object CMakeFiles/cmTryCompileExec2420167172.dir/CheckFunctionExists.c.o
    /usr/bin/cc -D_FILE_OFFSET_BITS=64 -D_LARGEFILE_SOURCE -D_LARGE_FILES -D__STDC_CONSTANT_MACROS -D__STDC_FORMAT_MACROS -D__STDC_LIMIT_MACROS -Wall -DCHECK_FUNCTION_EXISTS=io_queue_init -o CMakeFiles/cmTryCompileExec2420167172.dir/CheckFunctionExists.c.o -c /usr/local/share/cmake-2.8/Modules/CheckFunctionExists.c
    Linking C executable cmTryCompileExec2420167172
    /usr/local/bin/cmake -E cmake_link_script CMakeFiles/cmTryCompileExec2420167172.dir/link.txt --verbose=1
    /usr/bin/cc -Wall -DCHECK_FUNCTION_EXISTS=io_queue_init CMakeFiles/cmTryCompileExec2420167172.dir/CheckFunctionExists.c.o -o cmTryCompileExec2420167172 -rdynamic -laio -lm -lcrypt -ldl -lpthread -lrt
    /usr/bin/ld: cannot find -laio
    collect2: ld 返回 1
    gmake[1]: *** [cmTryCompileExec2420167172] 错误 1
    gmake[1]: Leaving directory `/root/lnmp/src/mysql-5.6.16/CMakeFiles/CMakeTmp'
    gmake: *** [cmTryCompileExec2420167172/fast] 错误 2
    15 回复  |  直到 1970-01-01 08:00:00 +08:00
        1
    bcxx   2014-02-15 23:14:32 +08:00
    依赖没装全
        2
    hcw1588   2014-02-15 23:20:05 +08:00
    @bcxx
    yum出现
    Transaction Check Error:
    file /usr/share/man/man1/ca.1ssl.gz from install of openssl-0.9.8e-27.el5_10.1.i686 conflicts with file from package openssl-0.9.8e-27.el5_10.1.x86_64
    file /usr/share/man/man1/req.1ssl.gz from install of openssl-0.9.8e-27.el5_10.1.i686 conflicts with file from package openssl-0.9.8e-27.el5_10.1.x86_64
    file /usr/share/man/man1/x509.1ssl.gz from install of openssl-0.9.8e-27.el5_10.1.i686 conflicts with file from package openssl-0.9.8e-27.el5_10.1.x86_64

    Error Summary
        3
    zeinima   2014-02-15 23:29:59 +08:00
    阿里云那IO,能忍?
        4
    hcw1588   2014-02-15 23:31:09 +08:00
    @zeinima 不是我的站,我纯属帮忙。。
        5
    pubby   2014-02-15 23:35:02 +08:00 via Android
    自己编译图个啥啊
        6
    11138   2014-02-16 02:03:09 +08:00
    最有用的信息应该是最后“/usr/bin/ld: cannot find -laio”这行吧。
    试过 yum install libaio-devel.x86_64 了吗?
        7
    11138   2014-02-16 02:09:44 +08:00
    原来还有“/usr/bin/ld: cannot find -lpthreads”
        8
    hcw1588   2014-02-16 03:16:03 +08:00
    @11138
    这货何解
    Transaction Check Error:
    file /usr/share/man/man1/ca.1ssl.gz from install of openssl-0.9.8e-27.el5_10.1.i686 conflicts with file from package openssl-0.9.8e-27.el5_10.1.x86_64
    file /usr/share/man/man1/req.1ssl.gz from install of openssl-0.9.8e-27.el5_10.1.i686 conflicts with file from package openssl-0.9.8e-27.el5_10.1.x86_64
    file /usr/share/man/man1/x509.1ssl.gz from install of openssl-0.9.8e-27.el5_10.1.i686 conflicts with file from package openssl-0.9.8e-27.el5_10.1.x86_64
        9
    chengxiao   2014-02-16 08:32:29 +08:00 via iPhone
    这根阿里云什么关系?
        10
    lwjef   2014-02-16 10:22:32 +08:00   ♥ 1
        11
    TheJuli   2014-02-16 10:31:05 +08:00
    这么长_(:з」∠)_
        12
    hcw1588   2014-02-16 11:22:37 +08:00
    @chengxiao 没关系啊,,只是表达了一下服务器位置。别的vps上就ok。。
        13
    msg7086   2014-02-16 14:25:51 +08:00
    这条帖子应该很贵吧……

    你贴的那个是64位与32位的包冲突。这服务器到底是32位还是64位的……
        14
    hcw1588   2014-02-16 18:15:57 +08:00
    @msg7086 64的
        15
    lwjef   2014-02-17 09:26:07 +08:00
    @msg7086 i686 不是 i386 =。=
    关于   ·   FAQ   ·   API   ·   我们的愿景   ·   广告投放   ·   感谢   ·   实用小工具   ·   2287 人在线   最高记录 5043   ·     Select Language
    创意工作者们的社区
    World is powered by solitude
    VERSION: 3.9.8.3 · 46ms · UTC 07:36 · PVG 15:36 · LAX 23:36 · JFK 02:36
    ♥ Do have faith in what you're doing.